{"text_format":"1","workbook":"xlsx","n_sheets":5,"sheets":["Jegyzőkönyv","Versenyszámok","Nyomtatás","Végeredmény","Kivetítő"],"not_rendered":{"charts":0,"images":1,"macros":1,"external_links":0,"defined_names":4,"comments":0,"pivot_tables":0},"unopened":[],"bounds":{"document_bytes":16777216,"sheet_cells":100000,"rows_first":2000,"rows_last":500,"rows_between":2000,"halvings":0,"cell_chars":16384,"cell_head_chars":4096},"cells_cut":0,"cells_raw":0,"read":"whole","date_system":"1900"}

{"sheet":"Jegyzőkönyv","index":0,"n_rows":131,"n_cols":36,"rows_kept":131,"cut":false,"hidden":false,"merged":[[57,1,61,1],[57,3,57,4],[57,5,61,5],[57,6,57,7],[57,8,61,8],[57,9,57,10],[57,11,61,11],[57,12,57,13],[57,14,61,14],[59,3,59,4],[59,6,59,7],[59,9,59,10],[59,12,59,13],[58,3,58,4],[58,6,58,7],[58,9,58,10],[58,12,58,13],[60,9,60,10],[60,12,60,13],[60,15,60,16],[52,29,56,29],[52,30,52,31],[52,32,56,32],[58,24,58,25],[58,27,58,28],[60,3,60,4],[60,6,60,7],[55,30,55,31],[57,15,57,16],[57,17,61,17],[57,18,57,19],[57,20,61,20],[57,21,57,22],[57,23,61,23],[57,24,57,25],[57,26,61,26],[57,27,57,28],[60,18,60,19],[59,15,59,16],[59,18,59,19],[59,21,59,22],[52,17,56,17],[52,18,52,19],[52,33,56,33],[53,30,53,31],[54,30,54,31],[52,15,52,16],[59,24,59,25],[59,27,59,28],[59,30,59,31],[60,27,60,28],[60,30,60,31],[57,32,61,32],[57,33,61,33],[58,30,58,31],[55,27,55,28],[60,21,60,22],[60,24,60,25],[57,30,57,31],[58,15,58,16],[58,18,58,19],[58,21,58,22],[57,29,61,29],[54,18,54,19],[54,21,54,22],[54,24,54,25],[54,27,54,28],[53,3,53,4],[53,6,53,7],[53,9,53,10],[53,12,53,13],[53,15,53,16],[53,18,53,19],[53,21,53,22],[53,24,53,25],[53,27,53,28],[52,20,56,20],[52,21,52,22],[52,23,56,23],[52,24,52,25],[52,26,56,26],[52,27,52,28],[55,18,55,19],[55,21,55,22],[55,24,55,25],[4,9,4,10],[5,3,5,4],[5,6,5,7],[5,9,5,10],[3,15,3,16],[52,1,56,1],[52,3,52,4],[52,5,56,5],[52,6,52,7],[52,8,56,8],[52,9,52,10],[52,11,56,11],[52,12,52,13],[52,14,56,14],[55,3,55,4],[55,6,55,7],[55,9,55,10],[55,12,55,13],[54,3,54,4],[54,6,54,7],[54,9,54,10],[54,12,54,13],[54,15,54,16],[55,15,55,16],[2,12,2,13],[2,15,2,16],[1,27,1,28],[2,26,6,26],[4,15,4,16],[4,18,4,19],[4,21,4,22],[1,15,1,16],[1,18,1,19],[2,20,6,20],[2,23,6,23],[2,32,6,32],[2,33,6,33],[3,3,3,4],[3,6,3,7],[3,9,3,10],[3,12,3,13],[4,3,4,4],[4,6,4,7],[17,24,17,25],[12,26,16,26],[12,12,12,13],[14,6,14,7],[14,9,14,10],[12,5,16,5],[12,8,16,8],[12,11,16,11],[9,12,9,13],[9,15,9,16],[9,18,9,19],[7,26,11,26],[7,21,7,22],[12,24,12,25],[7,24,7,25],[8,15,8,16],[2,30,2,31],[2,21,2,22],[2,24,2,25],[2,27,2,28],[1,21,1,22],[1,24,1,25],[2,18,2,19],[5,21,5,22],[5,24,5,25],[5,27,5,28],[1,30,1,31],[3,18,3,19],[0,26,1,26],[0,29,1,29],[2,1,6,1],[2,5,6,5],[2,8,6,8],[2,11,6,11],[8,18,8,19],[7,12,7,13],[7,15,7,16],[7,18,7,19],[2,3,2,4],[7,1,11,1],[7,5,11,5],[7,8,11,8],[7,11,11,11],[9,3,9,4],[9,6,9,7],[9,9,9,10],[7,3,7,4],[7,6,7,7],[7,9,7,10],[10,3,10,4],[10,6,10,7],[10,9,10,10],[2,6,2,7],[2,9,2,10],[12,33,16,33],[13,3,13,4],[13,6,13,7],[8,27,8,28],[7,23,11,23],[2,14,6,14],[5,12,5,13],[5,15,5,16],[4,12,4,13],[2,17,6,17],[5,18,5,19],[8,30,8,31],[7,29,11,29],[7,30,7,31],[3,24,3,25],[3,27,3,28],[3,30,3,31],[4,24,4,25],[4,27,4,28],[4,30,4,31],[2,29,6,29],[3,21,3,22],[7,27,7,28],[5,30,5,31],[7,32,11,32],[7,33,11,33],[8,3,8,4],[8,6,8,7],[8,9,8,10],[8,12,8,13],[7,14,11,14],[7,17,11,17],[7,20,11,20],[9,21,9,22],[10,30,10,31],[9,30,9,31],[10,12,10,13],[10,15,10,16],[10,18,10,19],[10,21,10,22],[9,24,9,25],[9,27,9,28],[10,24,10,25],[10,27,10,28],[8,21,8,22],[8,24,8,25],[12,27,12,28],[13,12,13,13],[13,15,13,16],[13,18,13,19],[15,3,15,4],[15,6,15,7],[15,9,15,10],[12,3,12,4],[14,3,14,4],[14,12,14,13],[12,15,12,16],[12,18,12,19],[12,6,12,7],[13,27,13,28],[13,24,13,25],[13,9,13,10],[14,15,14,16],[12,1,16,1],[12,32,16,32],[15,12,15,13],[15,15,15,16],[15,18,15,19],[15,21,15,22],[15,24,15,25],[15,27,15,28],[12,9,12,10],[12,14,16,14],[12,17,16,17],[12,20,16,20],[14,18,14,19],[14,21,14,22],[14,24,14,25],[14,27,14,28],[12,29,16,29],[13,30,13,31],[12,23,16,23],[13,21,13,22],[12,30,12,31],[12,21,12,22],[14,30,14,31],[15,30,15,31],[17,32,21,32],[18,6,18,7],[18,9,18,10],[18,12,18,13],[20,30,20,31],[19,30,19,31],[20,3,20,4],[20,6,20,7],[18,24,18,25],[18,27,18,28],[20,9,20,10],[20,12,20,13],[20,15,20,16],[20,18,20,19],[18,18,18,19],[19,3,19,4],[19,6,19,7],[19,9,19,10],[17,3,17,4],[17,6,17,7],[17,9,17,10],[17,27,17,28],[18,15,18,16],[17,21,17,22],[17,1,21,1],[17,5,21,5],[17,8,21,8],[17,11,21,11],[17,14,21,14],[17,17,21,17],[17,20,21,20],[22,30,22,31],[22,3,22,4],[22,5,26,5],[22,8,26,8],[25,15,25,16],[25,18,25,19],[22,23,26,23],[23,21,23,22],[22,18,22,19],[22,21,22,22],[22,17,26,17],[22,20,26,20],[18,3,18,4],[24,30,24,31],[25,30,25,31],[20,21,20,22],[19,21,19,22],[24,6,24,7],[24,9,24,10],[24,12,24,13],[22,11,26,11],[22,14,26,14],[17,33,21,33],[18,30,18,31],[17,29,21,29],[23,30,23,31],[19,24,19,25],[19,27,19,28],[20,24,20,25],[20,27,20,28],[17,23,21,23],[17,26,21,26],[18,21,18,22],[17,30,17,31],[22,29,26,29],[17,15,17,16],[17,18,17,19],[19,12,19,13],[19,15,19,16],[19,18,19,19],[17,12,17,13],[29,3,29,4],[29,6,29,7],[29,9,29,10],[27,3,27,4],[29,24,29,25],[22,33,26,33],[23,3,23,4],[23,6,23,7],[23,9,23,10],[23,12,23,13],[23,15,23,16],[23,18,23,19],[23,24,23,25],[22,32,26,32],[23,27,23,28],[25,3,25,4],[25,6,25,7],[25,9,25,10],[25,12,25,13],[22,6,22,7],[22,9,22,10],[22,12,22,13],[22,15,22,16],[24,3,24,4],[35,21,35,22],[34,18,34,19],[34,21,34,22],[30,12,30,13],[30,15,30,16],[22,1,26,1],[28,24,28,25],[28,27,28,28],[24,15,24,16],[24,18,24,19],[24,21,24,22],[27,6,27,7],[27,9,27,10],[27,1,31,1],[27,21,27,22],[27,17,31,17],[22,24,22,25],[22,27,22,28],[25,21,25,22],[25,24,25,25],[25,27,25,28],[24,24,24,25],[24,27,24,28],[22,26,26,26],[30,3,30,4],[30,6,30,7],[30,9,30,10],[32,23,36,23],[29,18,29,19],[33,21,33,22],[32,30,32,31],[27,24,27,25],[27,15,27,16],[27,18,27,19],[30,24,30,25],[30,18,30,19],[30,21,30,22],[29,21,29,22],[27,30,27,31],[30,30,30,31],[29,30,29,31],[27,29,31,29],[29,27,29,28],[28,30,28,31],[32,18,32,19],[32,21,32,22],[32,20,36,20],[35,18,35,19],[35,9,35,10],[35,12,35,13],[35,15,35,16],[27,33,31,33],[28,3,28,4],[28,6,28,7],[28,9,28,10],[28,12,28,13],[28,15,28,16],[28,18,28,19],[28,21,28,22],[30,27,30,28],[27,23,31,23],[27,26,31,26],[27,27,27,28],[27,32,31,32],[27,20,31,20],[27,12,27,13],[29,12,29,13],[29,15,29,16],[27,14,31,14],[27,5,31,5],[27,8,31,8],[27,11,31,11],[33,15,33,16],[33,18,33,19],[32,3,32,4],[32,1,36,1],[32,5,36,5],[32,8,36,8],[32,11,36,11],[32,14,36,14],[32,17,36,17],[32,6,32,7],[32,9,32,10],[32,12,32,13],[32,15,32,16],[34,15,34,16],[33,3,33,4],[33,6,33,7],[33,9,33,10],[33,12,33,13],[34,3,34,4],[34,6,34,7],[34,9,34,10],[34,12,34,13],[35,3,35,4],[35,6,35,7],[37,1,41,1],[37,5,41,5],[37,8,41,8],[37,11,41,11],[37,3,37,4],[37,6,37,7],[33,24,33,25],[33,27,33,28],[33,30,33,31],[38,3,38,4],[38,6,38,7],[38,9,38,10],[38,12,38,13],[38,15,38,16],[39,3,39,4],[39,6,39,7],[37,9,37,10],[39,9,39,10],[39,12,39,13],[39,15,39,16],[37,23,41,23],[37,14,41,14],[37,17,41,17],[37,20,41,20],[32,32,36,32],[34,24,34,25],[34,27,34,28],[32,33,36,33],[37,30,37,31],[32,24,32,25],[32,27,32,28],[37,26,41,26],[37,29,41,29],[32,26,36,26],[32,29,36,29],[35,24,35,25],[35,27,35,28],[37,24,37,25],[37,27,37,28],[35,30,35,31],[37,32,41,32],[37,33,41,33],[38,30,38,31],[34,30,34,31],[37,12,37,13],[37,21,37,22],[37,15,37,16],[37,18,37,19],[38,27,38,28],[40,18,40,19],[40,21,40,22],[40,24,40,25],[40,27,40,28],[40,15,40,16],[38,18,38,19],[38,21,38,22],[38,24,38,25],[40,3,40,4],[40,6,40,7],[40,9,40,10],[40,12,40,13],[40,30,40,31],[39,18,39,19],[39,21,39,22],[39,24,39,25],[39,27,39,28],[39,30,39,31],[42,1,46,1],[42,3,42,4],[42,5,46,5],[42,6,42,7],[42,8,46,8],[42,9,42,10],[42,11,46,11],[42,12,42,13],[42,14,46,14],[45,3,45,4],[45,6,45,7],[45,9,45,10],[45,12,45,13],[42,18,42,19],[42,20,46,20],[42,21,42,22],[42,23,46,23],[42,24,42,25],[42,26,46,26],[42,27,42,28],[45,15,45,16],[45,18,45,19],[45,21,45,22],[45,24,45,25],[45,27,45,28],[42,32,46,32],[42,33,46,33],[43,3,43,4],[43,6,43,7],[43,9,43,10],[43,12,43,13],[43,15,43,16],[43,18,43,19],[43,21,43,22],[43,24,43,25],[43,27,43,28],[43,30,43,31],[44,3,44,4],[44,6,44,7],[44,9,44,10],[44,12,44,13],[44,15,44,16],[44,18,44,19],[44,21,44,22],[44,24,44,25],[44,27,44,28],[44,30,44,31],[42,15,42,16],[42,17,46,17],[47,32,51,32],[47,33,51,33],[48,3,48,4],[48,6,48,7],[48,9,48,10],[48,12,48,13],[48,15,48,16],[48,18,48,19],[48,21,48,22],[48,24,48,25],[48,27,48,28],[48,30,48,31],[49,3,49,4],[49,6,49,7],[49,9,49,10],[49,12,49,13],[49,15,49,16],[49,18,49,19],[49,21,49,22],[49,24,49,25],[49,27,49,28],[49,30,49,31],[0,1,1,1],[0,2,1,2],[0,5,1,5],[0,8,1,8],[0,11,1,11],[0,14,1,14],[0,17,1,17],[0,20,1,20],[0,23,1,23],[1,3,1,4],[1,6,1,7],[1,9,1,10],[1,12,1,13],[7,0,11,0],[12,0,16,0],[17,0,21,0],[22,0,26,0],[27,0,31,0],[32,0,36,0],[50,18,50,19],[50,21,50,22],[50,24,50,25],[50,3,50,4],[50,6,50,7],[47,1,51,1],[47,3,47,4],[47,5,51,5],[47,6,47,7],[47,8,51,8],[47,9,47,10],[47,11,51,11],[47,12,47,13],[47,14,51,14],[47,15,47,16],[47,17,51,17],[47,18,47,19],[47,20,51,20],[52,0,56,0],[57,0,61,0],[1,34,1,35],[2,34,2,35],[3,34,3,35],[4,34,4,35],[7,34,7,35],[8,34,8,35],[9,34,9,35],[12,34,12,35],[13,34,13,35],[14,34,14,35],[17,34,17,35],[18,34,18,35],[19,34,19,35],[22,34,22,35],[23,34,23,35],[24,34,24,35],[27,34,27,35],[28,34,28,35],[29,34,29,35],[0,32,1,32],[0,33,1,33],[2,0,6,0],[37,34,37,35],[38,34,38,35],[39,34,39,35],[42,34,42,35],[43,34,43,35],[44,34,44,35],[37,0,41,0],[42,0,46,0],[47,0,51,0],[50,27,50,28],[50,30,50,31],[45,30,45,31],[47,21,47,22],[47,23,51,23],[47,24,47,25],[47,26,51,26],[47,27,47,28],[47,29,51,29],[47,30,47,31],[50,9,50,10],[50,12,50,13],[50,15,50,16],[42,29,46,29],[42,30,42,31],[60,34,61,35],[5,34,6,35],[10,34,11,35],[15,34,16,35],[20,34,21,35],[25,34,26,35],[30,34,31,35],[35,34,36,35],[40,34,41,35],[45,34,46,35],[47,34,47,35],[48,34,48,35],[49,34,49,35],[52,34,52,35],[53,34,53,35],[54,34,54,35],[57,34,57,35],[58,34,58,35],[59,34,59,35],[50,34,51,35],[55,34,56,35],[32,34,32,35],[33,34,33,35],[34,34,34,35]]}
[null,"Csapatok",null,"pontozás:",{"$f":"Versenyszámok!E1","v":"idő"},"H.","pontozás:",{"$f":"Versenyszámok!E2","v":"idő"},"H.","pontozás:",{"$f":"Versenyszámok!E3","v":"idő"},"H.","pontozás:",{"$f":"Versenyszámok!E4","v":"idő"},"H.","pontozás:",{"$f":"Versenyszámok!E5","v":"idő"},"H.","pontozás:",{"$f":"Versenyszámok!E6","v":"idő"},"H.","pontozás:",{"$f":"Versenyszámok!E7","v":"idő"},"H.","pontozás:",{"$f":"Versenyszámok!E8","v":"idő"},"H.","pontozás:",{"$f":"Versenyszámok!E9","v":"idő"},"H.","pontozás:",{"$f":"Versenyszámok!E10","v":"helyezés"},"Ö:","H.","Holtverseny",{"$f":"Versenyszámok!E11","v":"idő"}]
[null,null,null,{"$f":"CONCATENATE(\"1. \",Versenyszámok!D1)","v":"1. Futás váltóbottal"},null,null,{"$f":"CONCATENATE(\"2. \",Versenyszámok!D2)","v":"2. Négykézlábjárás"},null,null,{"$f":"CONCATENATE(\"3. \",Versenyszámok!D3)","v":"3. Alagúton át"},null,null,{"$f":"CONCATENATE(\"4. \",Versenyszámok!D4)","v":"4. Labdás ügyességi váltó"},null,null,{"$f":"CONCATENATE(\"5. \",Versenyszámok!D5)","v":"5. Hídakadály"},null,null,{"$f":"CONCATENATE(\"6. \",Versenyszámok!D6)","v":"6. Bújj és karikában fuss"},null,null,{"$f":"CONCATENATE(\"7. \",Versenyszámok!D7)","v":"7. Karikarakó"},null,null,{"$f":"CONCATENATE(\"8. \",Versenyszámok!D8)","v":"8. Szlalom kézilabda"},null,null,{"$f":"CONCATENATE(\"9. \",Versenyszámok!D9)","v":"9. Karikán az akadályra"},null,null,{"$f":"CONCATENATE(\"10. \",Versenyszámok!D10)","v":"10. Bombázó"},null,null,null,{"$f":"Versenyszámok!D11","v":"Akadálypálya"}]
["1.","Pécs","Idő (p:mp:tmp):","00:02:10.520",null,{"$f":"IF(ISBLANK(D3),\"\",RANK(E7,(E$7,E$12,E$17,E$22,E$27,E$32,E$37,E$42,E$47,E$52,E$57,E$62),0))","v":3},"00:01:13.110",null,{"$f":"IF(ISBLANK(G3),\"\",RANK(H7,(H$7,H$12,H$17,H$22,H$27,H$32,H$37,H$42,H$47,H$52,H$57,H$62),0))","v":4},"00:02:33.450",null,{"$f":"IF(ISBLANK(J3),\"\",RANK(K7,(K$7,K$12,K$17,K$22,K$27,K$32,K$37,K$42,K$47,K$52,K$57,K$62),0))","v":4},"00:03:40.080",null,{"$f":"IF(ISBLANK(M3),\"\",RANK(N7,(N$7,N$12,N$17,N$22,N$27,N$32,N$37,N$42,N$47,N$52,N$57,N$62),0))","v":4},"00:00:22.600",null,{"$f":"IF(ISBLANK(P3),\"\",RANK(Q7,(Q$7,Q$12,Q$17,Q$22,Q$27,Q$32,Q$37,Q$42,Q$47,Q$52,Q$57,Q$62),0))","v":5},"00:01:39.800",null,{"$f":"IF(ISBLANK(S3),\"\",RANK(T7,(T$7,T$12,T$17,T$22,T$27,T$32,T$37,T$42,T$47,T$52,T$57,T$62),0))","v":5},"00:02:27.510",null,{"$f":"IF(ISBLANK(V3),\"\",RANK(W7,(W$7,W$12,W$17,W$22,W$27,W$32,W$37,W$42,W$47,W$52,W$57,W$62),0))","v":5},"00:01:49.070",null,{"$f":"IF(ISBLANK(Y3),\"\",RANK(Z7,(Z$7,Z$12,Z$17,Z$22,Z$27,Z$32,Z$37,Z$42,Z$47,Z$52,Z$57,Z$62),0))","v":5},"00:02:16.180",null,{"$f":"IF(ISBLANK(AB3),\"\",RANK(AC7,(AC$7,AC$12,AC$17,AC$22,AC$27,AC$32,AC$37,AC$42,AC$47,AC$52,AC$57,AC$62),0))","v":5},2,null,{"$f":"IF(ISBLANK(D3),\"\",SUM(D7,G7,J7,M7,P7,S7,V7,Y7,AB7,AE7,AE4)+IF(AI6=0,0,(($C$87-AI6+1)/1000)))","v":18},{"$f":"IF(ISBLANK(D3),\"\",RANK(AG3,($AG$3,$AG$8,$AG$13,$AG$18,$AG$23,$AG$28,$AG$33,$AG$38,$AG$43,$AG$48,$AG$53,$AG$58)))","v":5}]
[null,null,"Hiba (p:mp:tmp):",null,null,null,null,null,null,null,null,null,null,null,null,null,null,null,"00:00:05",null,null,"00:00:05"]
[null,null,"Össz.idő",{"$f":"SUM(D3,D4)","v":"00:02:10.520"},null,null,{"$f":"SUM(G3,G4)","v":"00:01:13.110"},null,null,{"$f":"SUM(J3,J4)","v":"00:02:33.450"},null,null,{"$f":"SUM(M3,M4)","v":"00:03:40.080"},null,null,{"$f":"SUM(P3,P4)","v":"00:00:22.600"},null,null,{"$f":"SUM(S3,S4)","v":"00:01:44.800"},null,null,{"$f":"SUM(V3,V4)","v":"00:02:32.510"},null,null,{"$f":"SUM(Y3,Y4)","v":"00:01:49.070"},null,null,{"$f":"SUM(AB3,AB4)","v":"00:02:16.180"},null,null,{"$f":"AE3","v":2},null,null,null,{"$f":"SUM(AI3:AJ4)","v":"00:00:00"}]
[null,null,"Helyezés",{"$f":"IF(ISBLANK(D3),\"\",E120)","v":3},null,null,{"$f":"IF(ISBLANK(G3),\"\",H120)","v":5},null,null,{"$f":"IF(ISBLANK(J3),\"\",K120)","v":5},null,null,{"$f":"IF(ISBLANK(M3),\"\",N120)","v":4},null,null,{"$f":"IF(ISBLANK(P3),\"\",Q120)","v":4},null,null,{"$f":"IF(ISBLANK(S3),\"\",T120)","v":5},null,null,{"$f":"IF(ISBLANK(V3),\"\",W120)","v":4},null,null,{"$f":"IF(ISBLANK(Y3),\"\",Z120)","v":5},null,null,{"$f":"IF(ISBLANK(AB3),\"\",AC120)","v":5},null,null,{"$f":"IF(ISBLANK(AE3),\"\",AF120)","v":2},null,null,null,{"$f":"IF(ISBLANK(AI3),0,AJ120)","v":"00:00:00"}]
{"$rows_left_out":126}
{"sheet":"Versenyszámok","index":1,"n_rows":40,"n_cols":14,"rows_kept":40,"cut":false,"hidden":false,"merged":[]}
["Versenyszámok:",1,{"$f":"CONCATENATE(VLOOKUP(D1,$K$1:$N$29,3,0),\"/\",VLOOKUP(D1,$K$1:$N$29,4,0),\".\")","v":"1/2."},"Futás váltóbottal",{"$f":"VLOOKUP(D1,$K$1:$L$29,2,0)","v":"idő"},null,null,null,null,1,"Krumpliültetés","idő",1,1]
[null,2,{"$f":"CONCATENATE(VLOOKUP(D2,$K$1:$N$29,3,0),\"/\",VLOOKUP(D2,$K$1:$N$29,4,0),\".\")","v":"2/1."},"Négykézlábjárás","idő",null,null,null,null,null,"Futás váltóbottal","idő",1,2]
[null,3,"3/2.","Alagúton át","idő",null,null,null,null,null,"Társhordás karikával","idő",1,3]
[null,4,"4/3.","Labdás ügyességi váltó","idő",null,null,null,null,2,"Négykézlábjárás","idő",2,1]
[null,5,"5/3.","Hídakadály","idő",null,null,null,null,null,"Pókjárás - Rákjárás","idő",2,2]
[null,6,"6/3.","Bújj és karikában fuss","idő",null,null,null,null,null,"Talicskaváltó","idő",2,3]
{"$rows_left_out":35}
{"sheet":"Nyomtatás","index":2,"n_rows":157,"n_cols":16,"rows_kept":157,"cut":false,"hidden":false,"merged":[[41,0,45,0],[46,0,50,0],[51,0,55,0],[56,0,60,0],[36,4,40,4],[36,0,40,0],[36,2,36,3],[37,2,37,3],[38,2,38,3],[39,2,39,3],[41,2,41,3],[41,4,45,4],[42,2,42,3],[43,2,43,3],[44,2,44,3],[46,2,46,3],[1,4,5,4],[6,4,10,4],[11,4,15,4],[16,4,20,4],[21,4,25,4],[26,4,30,4],[31,4,35,4],[26,0,30,0],[26,2,26,3],[27,2,27,3],[28,2,28,3],[29,2,29,3],[31,0,35,0],[31,2,31,3],[32,2,32,3],[33,2,33,3],[34,2,34,3],[16,0,20,0],[16,2,16,3],[17,2,17,3],[18,2,18,3],[19,2,19,3],[21,0,25,0],[21,2,21,3],[22,2,22,3],[23,2,23,3],[24,2,24,3],[0,2,0,3],[1,0,5,0],[1,2,1,3],[2,2,2,3],[3,2,3,3],[4,2,4,3],[11,0,15,0],[11,2,11,3],[12,2,12,3],[13,2,13,3],[14,2,14,3],[6,0,10,0],[6,2,6,3],[7,2,7,3],[8,2,8,3],[9,2,9,3],[46,4,50,4],[47,2,47,3],[48,2,48,3],[49,2,49,3],[51,2,51,3],[51,4,55,4],[52,2,52,3],[53,2,53,3],[54,2,54,3],[56,2,56,3],[56,4,60,4],[57,2,57,3],[58,2,58,3],[59,2,59,3]]}
["Csapatok","Versenyszám:",{"$f":"CONCATENATE(VLOOKUP(G1,Versenyszámok!B1:D10,2),\" \",VLOOKUP(G1,Versenyszámok!B1:D10,3))","v":"10/2. Bombázó"},null,"H.","Versenyszám:",10,null,null,null,null,null,null,null,null,1]
[{"$f":"IF(ISBLANK(Jegyzőkönyv!B3),\"\",Jegyzőkönyv!B3)","v":"Pécs"},"Idő (p:mp:tmp):",{"$f":"INDEX($B$101:$K$112,O2,$G$1)","v":2},null,{"$f":"Jegyzőkönyv!AH3","v":5},null,null,null,null,null,null,null,null,null,1,2]
[null,"Hiba (p:mp:tmp):",{"$f":"INDEX($B$122:$K$133,O2,$G$1)","v":"00:00:00"},null,null,null,null,null,null,null,null,null,null,null,null,3]
[null,"Össz.idő",{"$f":"SUM(C2:D3)","v":2},null,null,null,null,null,null,null,null,null,null,null,null,4]
[null,"Helyezés",{"$f":"IF(ISBLANK(C2),\"\",INDEX($B$68:$K$79,O2,$G$1))","v":2},null,null,null,null,null,null,null,null,null,null,null,null,5]
[null,"Pont/Összp.",{"$f":"INDEX($B$140:$K$151,O2,$G$1)","v":4},{"$f":"INDEX($B$84:$K$95,O2,$G$1)","v":18},null,null,null,null,null,null,null,null,null,null,null,6]
{"$rows_left_out":152}
{"sheet":"Végeredmény","index":3,"n_rows":13,"n_cols":8,"rows_kept":13,"cut":false,"hidden":false,"merged":[]}
["Helyezés","Iskola","Pontszám",null,null,{"$f":"Jegyzőkönyv!AG3","v":18},{"$f":"Jegyzőkönyv!AH3","v":5},{"$f":"Jegyzőkönyv!B3","v":"Pécs"}]
[{"$f":"IF(H1=\"\",\"\",\"I.\")","v":"I."},{"$f":"IF(F1=\"\",\"\",INDEX($H$1:$H$12,MATCH(C2,$F$1:$F$12,0)))","v":"Szombathely"},{"$f":"IF(F1=\"\",\"\",LARGE($F$1:$F$12,D2))","v":41},1,null,{"$f":"Jegyzőkönyv!AG8","v":27},{"$f":"Jegyzőkönyv!AH8","v":3},{"$f":"Jegyzőkönyv!B8","v":"Békés"}]
[{"$f":"IF(H2=\"\",\"\",\"II.\")","v":"II."},"Törökbálint",38,2,null,{"$f":"Jegyzőkönyv!AG13","v":26},{"$f":"Jegyzőkönyv!AH13","v":4},{"$f":"Jegyzőkönyv!B13","v":"Hajdúböszörmény"}]
[{"$f":"IF(H3=\"\",\"\",\"III.\")","v":"III."},"Békés",27,3,null,{"$f":"Jegyzőkönyv!AG18","v":38},{"$f":"Jegyzőkönyv!AH18","v":2},{"$f":"Jegyzőkönyv!B18","v":"Törökbálint"}]
[{"$f":"IF(H4=\"\",\"\",\"IV.\")","v":"IV."},"Hajdúböszörmény",26,4,null,{"$f":"Jegyzőkönyv!AG23","v":41},{"$f":"Jegyzőkönyv!AH23","v":1},{"$f":"Jegyzőkönyv!B23","v":"Szombathely"}]
[{"$f":"IF(H5=\"\",\"\",\"V.\")","v":"V."},"Pécs",18,5,null,{"$f":"Jegyzőkönyv!AG28","v":""},{"$f":"Jegyzőkönyv!AH28","v":""},{"$f":"Jegyzőkönyv!B28","v":0}]
{"$rows_left_out":8}
{"sheet":"Kivetítő","index":4,"n_rows":15,"n_cols":24,"rows_kept":15,"cut":false,"hidden":false,"merged":[[0,0,0,23],[1,22,1,23],[1,10,1,11],[1,12,1,13],[1,14,1,15],[1,16,1,17],[1,18,1,19],[1,20,1,21],[1,0,2,0],[1,1,2,1],[1,2,1,3],[1,4,1,5],[1,6,1,7],[1,8,1,9]]}
[{"$f":"IF(Versenyszámok!B13=\"\",\"\",Versenyszámok!B13)","v":""}]
["Ssz.","Csapat",{"$f":"Jegyzőkönyv!D2","v":"1. Futás váltóbottal"},null,{"$f":"Jegyzőkönyv!G2","v":"2. Négykézlábjárás"},null,{"$f":"Jegyzőkönyv!J2","v":"3. Alagúton át"},null,{"$f":"Jegyzőkönyv!M2","v":"4. Labdás ügyességi váltó"},null,{"$f":"Jegyzőkönyv!P2","v":"5. Hídakadály"},null,{"$f":"Jegyzőkönyv!S2","v":"6. Bújj és karikában fuss"},null,{"$f":"Jegyzőkönyv!V2","v":"7. Karikarakó"},null,{"$f":"Jegyzőkönyv!Y2","v":"8. Szlalom kézilabda"},null,{"$f":"Jegyzőkönyv!AB2","v":"9. Karikán az akadályra"},null,{"$f":"Jegyzőkönyv!AE2","v":"10. Bombázó"},null,"Összessített"]
[null,null,"Pontszám","Helyezés","Pontszám","Helyezés","Pontszám","Helyezés","Pontszám","Helyezés","Pontszám","Helyezés","Pontszám","Helyezés","Pontszám","Helyezés","Pontszám","Helyezés","Pontszám","Helyezés","Pontszám","Helyezés","Pontszám","Helyezés"]
[1,{"$f":"IF(ISBLANK(Jegyzőkönyv!B3),\"\",Jegyzőkönyv!B3)","v":"Pécs"},{"$f":"Jegyzőkönyv!D7","v":3},{"$f":"Jegyzőkönyv!D6","v":3},{"$f":"Jegyzőkönyv!G7","v":1},{"$f":"Jegyzőkönyv!G6","v":5},{"$f":"Jegyzőkönyv!J7","v":1},{"$f":"Jegyzőkönyv!J6","v":5},{"$f":"Jegyzőkönyv!M7","v":2},{"$f":"Jegyzőkönyv!M6","v":4},{"$f":"Jegyzőkönyv!P7","v":2},{"$f":"Jegyzőkönyv!P6","v":4},{"$f":"Jegyzőkönyv!S7","v":1},{"$f":"Jegyzőkönyv!S6","v":5},{"$f":"Jegyzőkönyv!V7","v":2},{"$f":"Jegyzőkönyv!V6","v":4},{"$f":"Jegyzőkönyv!Y7","v":1},{"$f":"Jegyzőkönyv!Y6","v":5},{"$f":"Jegyzőkönyv!AB7","v":1},{"$f":"Jegyzőkönyv!AB6","v":5},{"$f":"Jegyzőkönyv!AE7","v":4},{"$f":"Jegyzőkönyv!AE6","v":2},{"$f":"Jegyzőkönyv!AG3","v":18},{"$f":"Jegyzőkönyv!AH3","v":5}]
[2,{"$f":"IF(ISBLANK(Jegyzőkönyv!B8),\"\",Jegyzőkönyv!B8)","v":"Békés"},{"$f":"Jegyzőkönyv!D12","v":1},{"$f":"Jegyzőkönyv!D11","v":5},{"$f":"Jegyzőkönyv!G12","v":2},{"$f":"Jegyzőkönyv!G11","v":4},{"$f":"Jegyzőkönyv!J12","v":2},{"$f":"Jegyzőkönyv!J11","v":4},{"$f":"Jegyzőkönyv!M12","v":1},{"$f":"Jegyzőkönyv!M11","v":5},{"$f":"Jegyzőkönyv!P12","v":5},{"$f":"Jegyzőkönyv!P11","v":1},{"$f":"Jegyzőkönyv!S12","v":2},{"$f":"Jegyzőkönyv!S11","v":4},{"$f":"Jegyzőkönyv!V12","v":4},{"$f":"Jegyzőkönyv!V11","v":2},{"$f":"Jegyzőkönyv!Y12","v":3},{"$f":"Jegyzőkönyv!Y11","v":3},{"$f":"Jegyzőkönyv!AB12","v":2},{"$f":"Jegyzőkönyv!AB11","v":4},{"$f":"Jegyzőkönyv!AE12","v":5},{"$f":"Jegyzőkönyv!AE11","v":1},{"$f":"Jegyzőkönyv!AG8","v":27},{"$f":"Jegyzőkönyv!AH8","v":3}]
[3,{"$f":"IF(ISBLANK(Jegyzőkönyv!B13),\"\",Jegyzőkönyv!B13)","v":"Hajdúböszörmény"},{"$f":"Jegyzőkönyv!D17","v":2},{"$f":"Jegyzőkönyv!D16","v":4},{"$f":"Jegyzőkönyv!G17","v":5},{"$f":"Jegyzőkönyv!G16","v":1},{"$f":"Jegyzőkönyv!J17","v":3},{"$f":"Jegyzőkönyv!J16","v":3},{"$f":"Jegyzőkönyv!M17","v":5},{"$f":"Jegyzőkönyv!M16","v":1},{"$f":"Jegyzőkönyv!P17","v":1},{"$f":"Jegyzőkönyv!P16","v":5},{"$f":"Jegyzőkönyv!S17","v":3},{"$f":"Jegyzőkönyv!S16","v":3},{"$f":"Jegyzőkönyv!V17","v":1},{"$f":"Jegyzőkönyv!V16","v":5},{"$f":"Jegyzőkönyv!Y17","v":2},{"$f":"Jegyzőkönyv!Y16","v":4},{"$f":"Jegyzőkönyv!AB17","v":3},{"$f":"Jegyzőkönyv!AB16","v":3},{"$f":"Jegyzőkönyv!AE17","v":1},{"$f":"Jegyzőkönyv!AE16","v":5},{"$f":"Jegyzőkönyv!AG13","v":26},{"$f":"Jegyzőkönyv!AH13","v":4}]
{"$rows_left_out":9}