{"text_format":"1","workbook":"xlsx","n_sheets":5,"sheets":["Jegyzőkönyv","Versenyszámok","Nyomtatás","Végeredmény","Kivetítő"],"not_rendered":{"charts":0,"images":1,"macros":1,"external_links":0,"defined_names":4,"comments":0,"pivot_tables":0},"unopened":[],"bounds":{"document_bytes":16777216,"sheet_cells":100000,"rows_first":2000,"rows_last":500,"rows_between":2000,"halvings":0,"cell_chars":16384,"cell_head_chars":4096},"cells_cut":0,"cells_raw":0,"read":"whole","date_system":"1900"}

{"sheet":"Jegyzőkönyv","index":0,"n_rows":131,"n_cols":36,"rows_kept":131,"cut":false,"hidden":false,"merged":[[57,1,61,1],[57,3,57,4],[57,5,61,5],[57,6,57,7],[57,8,61,8],[57,9,57,10],[57,11,61,11],[57,12,57,13],[57,14,61,14],[59,3,59,4],[59,6,59,7],[59,9,59,10],[59,12,59,13],[58,3,58,4],[58,6,58,7],[58,9,58,10],[58,12,58,13],[60,9,60,10],[60,12,60,13],[60,15,60,16],[52,29,56,29],[52,30,52,31],[52,32,56,32],[58,24,58,25],[58,27,58,28],[60,3,60,4],[60,6,60,7],[55,30,55,31],[57,15,57,16],[57,17,61,17],[57,18,57,19],[57,20,61,20],[57,21,57,22],[57,23,61,23],[57,24,57,25],[57,26,61,26],[57,27,57,28],[60,18,60,19],[59,15,59,16],[59,18,59,19],[59,21,59,22],[52,17,56,17],[52,18,52,19],[52,33,56,33],[53,30,53,31],[54,30,54,31],[52,15,52,16],[59,24,59,25],[59,27,59,28],[59,30,59,31],[60,27,60,28],[60,30,60,31],[57,32,61,32],[57,33,61,33],[58,30,58,31],[55,27,55,28],[60,21,60,22],[60,24,60,25],[57,30,57,31],[58,15,58,16],[58,18,58,19],[58,21,58,22],[57,29,61,29],[54,18,54,19],[54,21,54,22],[54,24,54,25],[54,27,54,28],[53,3,53,4],[53,6,53,7],[53,9,53,10],[53,12,53,13],[53,15,53,16],[53,18,53,19],[53,21,53,22],[53,24,53,25],[53,27,53,28],[52,20,56,20],[52,21,52,22],[52,23,56,23],[52,24,52,25],[52,26,56,26],[52,27,52,28],[55,18,55,19],[55,21,55,22],[55,24,55,25],[4,9,4,10],[5,3,5,4],[5,6,5,7],[5,9,5,10],[3,15,3,16],[52,1,56,1],[52,3,52,4],[52,5,56,5],[52,6,52,7],[52,8,56,8],[52,9,52,10],[52,11,56,11],[52,12,52,13],[52,14,56,14],[55,3,55,4],[55,6,55,7],[55,9,55,10],[55,12,55,13],[54,3,54,4],[54,6,54,7],[54,9,54,10],[54,12,54,13],[54,15,54,16],[55,15,55,16],[2,12,2,13],[2,15,2,16],[1,27,1,28],[2,26,6,26],[4,15,4,16],[4,18,4,19],[4,21,4,22],[1,15,1,16],[1,18,1,19],[2,20,6,20],[2,23,6,23],[2,32,6,32],[2,33,6,33],[3,3,3,4],[3,6,3,7],[3,9,3,10],[3,12,3,13],[4,3,4,4],[4,6,4,7],[17,24,17,25],[12,26,16,26],[12,12,12,13],[14,6,14,7],[14,9,14,10],[12,5,16,5],[12,8,16,8],[12,11,16,11],[9,12,9,13],[9,15,9,16],[9,18,9,19],[7,26,11,26],[7,21,7,22],[12,24,12,25],[7,24,7,25],[8,15,8,16],[2,30,2,31],[2,21,2,22],[2,24,2,25],[2,27,2,28],[1,21,1,22],[1,24,1,25],[2,18,2,19],[5,21,5,22],[5,24,5,25],[5,27,5,28],[1,30,1,31],[3,18,3,19],[0,26,1,26],[0,29,1,29],[2,1,6,1],[2,5,6,5],[2,8,6,8],[2,11,6,11],[8,18,8,19],[7,12,7,13],[7,15,7,16],[7,18,7,19],[2,3,2,4],[7,1,11,1],[7,5,11,5],[7,8,11,8],[7,11,11,11],[9,3,9,4],[9,6,9,7],[9,9,9,10],[7,3,7,4],[7,6,7,7],[7,9,7,10],[10,3,10,4],[10,6,10,7],[10,9,10,10],[2,6,2,7],[2,9,2,10],[12,33,16,33],[13,3,13,4],[13,6,13,7],[8,27,8,28],[7,23,11,23],[2,14,6,14],[5,12,5,13],[5,15,5,16],[4,12,4,13],[2,17,6,17],[5,18,5,19],[8,30,8,31],[7,29,11,29],[7,30,7,31],[3,24,3,25],[3,27,3,28],[3,30,3,31],[4,24,4,25],[4,27,4,28],[4,30,4,31],[2,29,6,29],[3,21,3,22],[7,27,7,28],[5,30,5,31],[7,32,11,32],[7,33,11,33],[8,3,8,4],[8,6,8,7],[8,9,8,10],[8,12,8,13],[7,14,11,14],[7,17,11,17],[7,20,11,20],[9,21,9,22],[10,30,10,31],[9,30,9,31],[10,12,10,13],[10,15,10,16],[10,18,10,19],[10,21,10,22],[9,24,9,25],[9,27,9,28],[10,24,10,25],[10,27,10,28],[8,21,8,22],[8,24,8,25],[12,27,12,28],[13,12,13,13],[13,15,13,16],[13,18,13,19],[15,3,15,4],[15,6,15,7],[15,9,15,10],[12,3,12,4],[14,3,14,4],[14,12,14,13],[12,15,12,16],[12,18,12,19],[12,6,12,7],[13,27,13,28],[13,24,13,25],[13,9,13,10],[14,15,14,16],[12,1,16,1],[12,32,16,32],[15,12,15,13],[15,15,15,16],[15,18,15,19],[15,21,15,22],[15,24,15,25],[15,27,15,28],[12,9,12,10],[12,14,16,14],[12,17,16,17],[12,20,16,20],[14,18,14,19],[14,21,14,22],[14,24,14,25],[14,27,14,28],[12,29,16,29],[13,30,13,31],[12,23,16,23],[13,21,13,22],[12,30,12,31],[12,21,12,22],[14,30,14,31],[15,30,15,31],[17,32,21,32],[18,6,18,7],[18,9,18,10],[18,12,18,13],[20,30,20,31],[19,30,19,31],[20,3,20,4],[20,6,20,7],[18,24,18,25],[18,27,18,28],[20,9,20,10],[20,12,20,13],[20,15,20,16],[20,18,20,19],[18,18,18,19],[19,3,19,4],[19,6,19,7],[19,9,19,10],[17,3,17,4],[17,6,17,7],[17,9,17,10],[17,27,17,28],[18,15,18,16],[17,21,17,22],[17,1,21,1],[17,5,21,5],[17,8,21,8],[17,11,21,11],[17,14,21,14],[17,17,21,17],[17,20,21,20],[22,30,22,31],[22,3,22,4],[22,5,26,5],[22,8,26,8],[25,15,25,16],[25,18,25,19],[22,23,26,23],[23,21,23,22],[22,18,22,19],[22,21,22,22],[22,17,26,17],[22,20,26,20],[18,3,18,4],[24,30,24,31],[25,30,25,31],[20,21,20,22],[19,21,19,22],[24,6,24,7],[24,9,24,10],[24,12,24,13],[22,11,26,11],[22,14,26,14],[17,33,21,33],[18,30,18,31],[17,29,21,29],[23,30,23,31],[19,24,19,25],[19,27,19,28],[20,24,20,25],[20,27,20,28],[17,23,21,23],[17,26,21,26],[18,21,18,22],[17,30,17,31],[22,29,26,29],[17,15,17,16],[17,18,17,19],[19,12,19,13],[19,15,19,16],[19,18,19,19],[17,12,17,13],[29,3,29,4],[29,6,29,7],[29,9,29,10],[27,3,27,4],[29,24,29,25],[22,33,26,33],[23,3,23,4],[23,6,23,7],[23,9,23,10],[23,12,23,13],[23,15,23,16],[23,18,23,19],[23,24,23,25],[22,32,26,32],[23,27,23,28],[25,3,25,4],[25,6,25,7],[25,9,25,10],[25,12,25,13],[22,6,22,7],[22,9,22,10],[22,12,22,13],[22,15,22,16],[24,3,24,4],[35,21,35,22],[34,18,34,19],[34,21,34,22],[30,12,30,13],[30,15,30,16],[22,1,26,1],[28,24,28,25],[28,27,28,28],[24,15,24,16],[24,18,24,19],[24,21,24,22],[27,6,27,7],[27,9,27,10],[27,1,31,1],[27,21,27,22],[27,17,31,17],[22,24,22,25],[22,27,22,28],[25,21,25,22],[25,24,25,25],[25,27,25,28],[24,24,24,25],[24,27,24,28],[22,26,26,26],[30,3,30,4],[30,6,30,7],[30,9,30,10],[32,23,36,23],[29,18,29,19],[33,21,33,22],[32,30,32,31],[27,24,27,25],[27,15,27,16],[27,18,27,19],[30,24,30,25],[30,18,30,19],[30,21,30,22],[29,21,29,22],[27,30,27,31],[30,30,30,31],[29,30,29,31],[27,29,31,29],[29,27,29,28],[28,30,28,31],[32,18,32,19],[32,21,32,22],[32,20,36,20],[35,18,35,19],[35,9,35,10],[35,12,35,13],[35,15,35,16],[27,33,31,33],[28,3,28,4],[28,6,28,7],[28,9,28,10],[28,12,28,13],[28,15,28,16],[28,18,28,19],[28,21,28,22],[30,27,30,28],[27,23,31,23],[27,26,31,26],[27,27,27,28],[27,32,31,32],[27,20,31,20],[27,12,27,13],[29,12,29,13],[29,15,29,16],[27,14,31,14],[27,5,31,5],[27,8,31,8],[27,11,31,11],[33,15,33,16],[33,18,33,19],[32,3,32,4],[32,1,36,1],[32,5,36,5],[32,8,36,8],[32,11,36,11],[32,14,36,14],[32,17,36,17],[32,6,32,7],[32,9,32,10],[32,12,32,13],[32,15,32,16],[34,15,34,16],[33,3,33,4],[33,6,33,7],[33,9,33,10],[33,12,33,13],[34,3,34,4],[34,6,34,7],[34,9,34,10],[34,12,34,13],[35,3,35,4],[35,6,35,7],[37,1,41,1],[37,5,41,5],[37,8,41,8],[37,11,41,11],[37,3,37,4],[37,6,37,7],[33,24,33,25],[33,27,33,28],[33,30,33,31],[38,3,38,4],[38,6,38,7],[38,9,38,10],[38,12,38,13],[38,15,38,16],[39,3,39,4],[39,6,39,7],[37,9,37,10],[39,9,39,10],[39,12,39,13],[39,15,39,16],[37,23,41,23],[37,14,41,14],[37,17,41,17],[37,20,41,20],[32,32,36,32],[34,24,34,25],[34,27,34,28],[32,33,36,33],[37,30,37,31],[32,24,32,25],[32,27,32,28],[37,26,41,26],[37,29,41,29],[32,26,36,26],[32,29,36,29],[35,24,35,25],[35,27,35,28],[37,24,37,25],[37,27,37,28],[35,30,35,31],[37,32,41,32],[37,33,41,33],[38,30,38,31],[34,30,34,31],[37,12,37,13],[37,21,37,22],[37,15,37,16],[37,18,37,19],[38,27,38,28],[40,18,40,19],[40,21,40,22],[40,24,40,25],[40,27,40,28],[40,15,40,16],[38,18,38,19],[38,21,38,22],[38,24,38,25],[40,3,40,4],[40,6,40,7],[40,9,40,10],[40,12,40,13],[40,30,40,31],[39,18,39,19],[39,21,39,22],[39,24,39,25],[39,27,39,28],[39,30,39,31],[42,1,46,1],[42,3,42,4],[42,5,46,5],[42,6,42,7],[42,8,46,8],[42,9,42,10],[42,11,46,11],[42,12,42,13],[42,14,46,14],[45,3,45,4],[45,6,45,7],[45,9,45,10],[45,12,45,13],[42,18,42,19],[42,20,46,20],[42,21,42,22],[42,23,46,23],[42,24,42,25],[42,26,46,26],[42,27,42,28],[45,15,45,16],[45,18,45,19],[45,21,45,22],[45,24,45,25],[45,27,45,28],[42,32,46,32],[42,33,46,33],[43,3,43,4],[43,6,43,7],[43,9,43,10],[43,12,43,13],[43,15,43,16],[43,18,43,19],[43,21,43,22],[43,24,43,25],[43,27,43,28],[43,30,43,31],[44,3,44,4],[44,6,44,7],[44,9,44,10],[44,12,44,13],[44,15,44,16],[44,18,44,19],[44,21,44,22],[44,24,44,25],[44,27,44,28],[44,30,44,31],[42,15,42,16],[42,17,46,17],[47,32,51,32],[47,33,51,33],[48,3,48,4],[48,6,48,7],[48,9,48,10],[48,12,48,13],[48,15,48,16],[48,18,48,19],[48,21,48,22],[48,24,48,25],[48,27,48,28],[48,30,48,31],[49,3,49,4],[49,6,49,7],[49,9,49,10],[49,12,49,13],[49,15,49,16],[49,18,49,19],[49,21,49,22],[49,24,49,25],[49,27,49,28],[49,30,49,31],[0,1,1,1],[0,2,1,2],[0,5,1,5],[0,8,1,8],[0,11,1,11],[0,14,1,14],[0,17,1,17],[0,20,1,20],[0,23,1,23],[1,3,1,4],[1,6,1,7],[1,9,1,10],[1,12,1,13],[7,0,11,0],[12,0,16,0],[17,0,21,0],[22,0,26,0],[27,0,31,0],[32,0,36,0],[50,18,50,19],[50,21,50,22],[50,24,50,25],[50,3,50,4],[50,6,50,7],[47,1,51,1],[47,3,47,4],[47,5,51,5],[47,6,47,7],[47,8,51,8],[47,9,47,10],[47,11,51,11],[47,12,47,13],[47,14,51,14],[47,15,47,16],[47,17,51,17],[47,18,47,19],[47,20,51,20],[52,0,56,0],[57,0,61,0],[1,34,1,35],[2,34,2,35],[3,34,3,35],[4,34,4,35],[7,34,7,35],[8,34,8,35],[9,34,9,35],[12,34,12,35],[13,34,13,35],[14,34,14,35],[17,34,17,35],[18,34,18,35],[19,34,19,35],[22,34,22,35],[23,34,23,35],[24,34,24,35],[27,34,27,35],[28,34,28,35],[29,34,29,35],[0,32,1,32],[0,33,1,33],[2,0,6,0],[37,34,37,35],[38,34,38,35],[39,34,39,35],[42,34,42,35],[43,34,43,35],[44,34,44,35],[37,0,41,0],[42,0,46,0],[47,0,51,0],[50,27,50,28],[50,30,50,31],[45,30,45,31],[47,21,47,22],[47,23,51,23],[47,24,47,25],[47,26,51,26],[47,27,47,28],[47,29,51,29],[47,30,47,31],[50,9,50,10],[50,12,50,13],[50,15,50,16],[42,29,46,29],[42,30,42,31],[60,34,61,35],[5,34,6,35],[10,34,11,35],[15,34,16,35],[20,34,21,35],[25,34,26,35],[30,34,31,35],[35,34,36,35],[40,34,41,35],[45,34,46,35],[47,34,47,35],[48,34,48,35],[49,34,49,35],[52,34,52,35],[53,34,53,35],[54,34,54,35],[57,34,57,35],[58,34,58,35],[59,34,59,35],[50,34,51,35],[55,34,56,35],[32,34,32,35],[33,34,33,35],[34,34,34,35]]}
[null,"Csapatok",null,"pontozás:",{"$f":"Versenyszámok!E1","v":"idő"},"H.","pontozás:",{"$f":"Versenyszámok!E2","v":"idő"},"H.","pontozás:",{"$f":"Versenyszámok!E3","v":"idő"},"H.","pontozás:",{"$f":"Versenyszámok!E4","v":"idő"},"H.","pontozás:",{"$f":"Versenyszámok!E5","v":"idő"},"H.","pontozás:",{"$f":"Versenyszámok!E6","v":"idő"},"H.","pontozás:",{"$f":"Versenyszámok!E7","v":"idő"},"H.","pontozás:",{"$f":"Versenyszámok!E8","v":"idő"},"H.","pontozás:",{"$f":"Versenyszámok!E9","v":"idő"},"H.","pontozás:",{"$f":"Versenyszámok!E10","v":"helyezés"},"Ö:","H.","Holtverseny",{"$f":"Versenyszámok!E11","v":"idő"}]
[null,null,null,{"$f":"CONCATENATE(\"1. \",Versenyszámok!D1)","v":"1. Futás váltóbottal"},null,null,{"$f":"CONCATENATE(\"2. \",Versenyszámok!D2)","v":"2. Négykézlábjárás"},null,null,{"$f":"CONCATENATE(\"3. \",Versenyszámok!D3)","v":"3. Alagúton át"},null,null,{"$f":"CONCATENATE(\"4. \",Versenyszámok!D4)","v":"4. Labdás ügyességi váltó"},null,null,{"$f":"CONCATENATE(\"5. \",Versenyszámok!D5)","v":"5. Hídakadály"},null,null,{"$f":"CONCATENATE(\"6. \",Versenyszámok!D6)","v":"6. Bújj és karikában fuss"},null,null,{"$f":"CONCATENATE(\"7. \",Versenyszámok!D7)","v":"7. Karikarakó"},null,null,{"$f":"CONCATENATE(\"8. \",Versenyszámok!D8)","v":"8. Szlalom kézilabda"},null,null,{"$f":"CONCATENATE(\"9. \",Versenyszámok!D9)","v":"9. Karikán az akadályra"},null,null,{"$f":"CONCATENATE(\"10. \",Versenyszámok!D10)","v":"10. Bombázó"},null,null,null,{"$f":"Versenyszámok!D11","v":"Akadálypálya"}]
["1.","Pécs","Idő (p:mp:tmp):","00:02:10.520",null,{"$f":"IF(ISBLANK(D3),\"\",RANK(E7,(E$7,E$12,E$17,E$22,E$27,E$32,E$37,E$42,E$47,E$52,E$57,E$62),0))","v":3},"00:01:13.110",null,{"$f":"IF(ISBLANK(G3),\"\",RANK(H7,(H$7,H$12,H$17,H$22,H$27,H$32,H$37,H$42,H$47,H$52,H$57,H$62),0))","v":4},"00:02:33.450",null,{"$f":"IF(ISBLANK(J3),\"\",RANK(K7,(K$7,K$12,K$17,K$22,K$27,K$32,K$37,K$42,K$47,K$52,K$57,K$62),0))","v":4},"00:03:40.080",null,{"$f":"IF(ISBLANK(M3),\"\",RANK(N7,(N$7,N$12,N$17,N$22,N$27,N$32,N$37,N$42,N$47,N$52,N$57,N$62),0))","v":4},"00:00:22.600",null,{"$f":"IF(ISBLANK(P3),\"\",RANK(Q7,(Q$7,Q$12,Q$17,Q$22,Q$27,Q$32,Q$37,Q$42,Q$47,Q$52,Q$57,Q$62),0))","v":5},"00:01:39.800",null,{"$f":"IF(ISBLANK(S3),\"\",RANK(T7,(T$7,T$12,T$17,T$22,T$27,T$32,T$37,T$42,T$47,T$52,T$57,T$62),0))","v":5},"00:02:27.510",null,{"$f":"IF(ISBLANK(V3),\"\",RANK(W7,(W$7,W$12,W$17,W$22,W$27,W$32,W$37,W$42,W$47,W$52,W$57,W$62),0))","v":5},"00:01:49.070",null,{"$f":"IF(ISBLANK(Y3),\"\",RANK(Z7,(Z$7,Z$12,Z$17,Z$22,Z$27,Z$32,Z$37,Z$42,Z$47,Z$52,Z$57,Z$62),0))","v":5},"00:02:16.180",null,{"$f":"IF(ISBLANK(AB3),\"\",RANK(AC7,(AC$7,AC$12,AC$17,AC$22,AC$27,AC$32,AC$37,AC$42,AC$47,AC$52,AC$57,AC$62),0))","v":5},2,null,{"$f":"IF(ISBLANK(D3),\"\",SUM(D7,G7,J7,M7,P7,S7,V7,Y7,AB7,AE7,AE4)+IF(AI6=0,0,(($C$87-AI6+1)/1000)))","v":18},{"$f":"IF(ISBLANK(D3),\"\",RANK(AG3,($AG$3,$AG$8,$AG$13,$AG$18,$AG$23,$AG$28,$AG$33,$AG$38,$AG$43,$AG$48,$AG$53,$AG$58)))","v":5}]
[null,null,"Hiba (p:mp:tmp):",null,null,null,null,null,null,null,null,null,null,null,null,null,null,null,"00:00:05",null,null,"00:00:05"]
[null,null,"Össz.idő",{"$f":"SUM(D3,D4)","v":"00:02:10.520"},null,null,{"$f":"SUM(G3,G4)","v":"00:01:13.110"},null,null,{"$f":"SUM(J3,J4)","v":"00:02:33.450"},null,null,{"$f":"SUM(M3,M4)","v":"00:03:40.080"},null,null,{"$f":"SUM(P3,P4)","v":"00:00:22.600"},null,null,{"$f":"SUM(S3,S4)","v":"00:01:44.800"},null,null,{"$f":"SUM(V3,V4)","v":"00:02:32.510"},null,null,{"$f":"SUM(Y3,Y4)","v":"00:01:49.070"},null,null,{"$f":"SUM(AB3,AB4)","v":"00:02:16.180"},null,null,{"$f":"AE3","v":2},null,null,null,{"$f":"SUM(AI3:AJ4)","v":"00:00:00"}]
[null,null,"Helyezés",{"$f":"IF(ISBLANK(D3),\"\",E120)","v":3},null,null,{"$f":"IF(ISBLANK(G3),\"\",H120)","v":5},null,null,{"$f":"IF(ISBLANK(J3),\"\",K120)","v":5},null,null,{"$f":"IF(ISBLANK(M3),\"\",N120)","v":4},null,null,{"$f":"IF(ISBLANK(P3),\"\",Q120)","v":4},null,null,{"$f":"IF(ISBLANK(S3),\"\",T120)","v":5},null,null,{"$f":"IF(ISBLANK(V3),\"\",W120)","v":4},null,null,{"$f":"IF(ISBLANK(Y3),\"\",Z120)","v":5},null,null,{"$f":"IF(ISBLANK(AB3),\"\",AC120)","v":5},null,null,{"$f":"IF(ISBLANK(AE3),\"\",AF120)","v":2},null,null,null,{"$f":"IF(ISBLANK(AI3),0,AJ120)","v":"00:00:00"}]
[null,null,"Pont/Összp.",{"$f":"IF(ISBLANK(D3),\"\",$C$87-E103+1)","v":3},{"$f":"D7","v":3},null,{"$f":"IF(ISBLANK(G3),\"\",$C$87-H103+1)","v":1},{"$f":"IF(ISBLANK(G3),\"\",SUM(E7,G7))","v":4},null,{"$f":"IF(ISBLANK(J3),\"\",$C$87-K103+1)","v":1},{"$f":"IF(ISBLANK(J3),\"\",SUM(H7,J7))","v":5},null,{"$f":"IF(ISBLANK(M3),\"\",$C$87-N103+1)","v":2},{"$f":"IF(ISBLANK(M3),\"\",SUM(K7,M7))","v":7},null,{"$f":"IF(ISBLANK(P3),\"\",$C$87-Q103+1)","v":2},{"$f":"IF(ISBLANK(P3),\"\",SUM(N7,P7))","v":9},null,{"$f":"IF(ISBLANK(S3),\"\",$C$87-T103+1)","v":1},{"$f":"IF(ISBLANK(S3),\"\",SUM(Q7,S7))","v":10},null,{"$f":"IF(ISBLANK(V3),\"\",$C$87-W103+1)","v":2},{"$f":"IF(ISBLANK(V3),\"\",SUM(T7,V7))","v":12},null,{"$f":"IF(ISBLANK(Y3),\"\",$C$87-Z103+1)","v":1},{"$f":"IF(ISBLANK(Y3),\"\",SUM(W7,Y7))","v":13},null,{"$f":"IF(ISBLANK(AB3),\"\",$C$87-AC103+1)","v":1},{"$f":"IF(ISBLANK(AB3),\"\",SUM(Z7,AB7))","v":14},null,{"$f":"IF(ISBLANK(AE3),\"\",$C$87-AF103+1)","v":4},{"$f":"IF(ISBLANK(AE3),\"\",SUM(AC7,AE7))","v":18}]
["2.","Békés","Idő (p:mp:tmp):","00:02:10.030",null,{"$f":"IF(ISBLANK(D8),\"\",RANK(E12,(E$7,E$12,E$17,E$22,E$27,E$32,E$37,E$42,E$47,E$52,E$57,E$62),0))","v":5},"00:01:11.440",null,{"$f":"IF(ISBLANK(G8),\"\",RANK(H12,(H$7,H$12,H$17,H$22,H$27,H$32,H$37,H$42,H$47,H$52,H$57,H$62),0))","v":5},"00:02:29.230",null,{"$f":"IF(ISBLANK(J8),\"\",RANK(K12,(K$7,K$12,K$17,K$22,K$27,K$32,K$37,K$42,K$47,K$52,K$57,K$62),0))","v":4},"00:03:56.830",null,{"$f":"IF(ISBLANK(M8),\"\",RANK(N12,(N$7,N$12,N$17,N$22,N$27,N$32,N$37,N$42,N$47,N$52,N$57,N$62),0))","v":5},"00:00:20.570",null,{"$f":"IF(ISBLANK(P8),\"\",RANK(Q12,(Q$7,Q$12,Q$17,Q$22,Q$27,Q$32,Q$37,Q$42,Q$47,Q$52,Q$57,Q$62),0))","v":4},"00:01:38.890",null,{"$f":"IF(ISBLANK(S8),\"\",RANK(T12,(T$7,T$12,T$17,T$22,T$27,T$32,T$37,T$42,T$47,T$52,T$57,T$62),0))","v":4},"00:02:26.240",null,{"$f":"IF(ISBLANK(V8),\"\",RANK(W12,(W$7,W$12,W$17,W$22,W$27,W$32,W$37,W$42,W$47,W$52,W$57,W$62),0))","v":4},"00:01:36.150",null,{"$f":"IF(ISBLANK(Y8),\"\",RANK(Z12,(Z$7,Z$12,Z$17,Z$22,Z$27,Z$32,Z$37,Z$42,Z$47,Z$52,Z$57,Z$62),0))","v":4},"00:02:13.940",null,{"$f":"IF(ISBLANK(AB8),\"\",RANK(AC12,(AC$7,AC$12,AC$17,AC$22,AC$27,AC$32,AC$37,AC$42,AC$47,AC$52,AC$57,AC$62),0))","v":4},1,null,{"$f":"IF(ISBLANK(D8),\"\",SUM(D12,G12,J12,M12,P12,S12,V12,Y12,AB12,AE12,AE9)+IF(AI11=0,0,(($C$87-AI11+1)/1000)))","v":27},{"$f":"IF(ISBLANK(D8),\"\",RANK(AG8,($AG$3,$AG$8,$AG$13,$AG$18,$AG$23,$AG$28,$AG$33,$AG$38,$AG$43,$AG$48,$AG$53,$AG$58)))","v":3}]
[null,null,"Hiba (p:mp:tmp):","00:00:01",null,null,"00:00:01",null,null,null,null,null,null,null,null,null,null,null,null,null,null,"00:00:05",null,null,"00:00:05",null,null,"00:00:01"]
[null,null,"Össz.idő",{"$f":"SUM(D8,D9)","v":"00:02:11.030"},null,null,{"$f":"SUM(G8,G9)","v":"00:01:12.440"},null,null,{"$f":"SUM(J8,J9)","v":"00:02:29.230"},null,null,{"$f":"SUM(M8,M9)","v":"00:03:56.830"},null,null,{"$f":"SUM(P8,P9)","v":"00:00:20.570"},null,null,{"$f":"SUM(S8,S9)","v":"00:01:38.890"},null,null,{"$f":"SUM(V8,V9)","v":"00:02:31.240"},null,null,{"$f":"SUM(Y8,Y9)","v":"00:01:41.150"},null,null,{"$f":"SUM(AB8,AB9)","v":"00:02:14.940"},null,null,{"$f":"AE8","v":1},null,null,null,{"$f":"SUM(AI8:AJ9)","v":"00:00:00"}]
[null,null,"Helyezés",{"$f":"IF(ISBLANK(D8),\"\",E121)","v":5},null,null,{"$f":"IF(ISBLANK(G8),\"\",H121)","v":4},null,null,{"$f":"IF(ISBLANK(J8),\"\",K121)","v":4},null,null,{"$f":"IF(ISBLANK(M8),\"\",N121)","v":5},null,null,{"$f":"IF(ISBLANK(P8),\"\",Q121)","v":1},null,null,{"$f":"IF(ISBLANK(S8),\"\",T121)","v":4},null,null,{"$f":"IF(ISBLANK(V8),\"\",W121)","v":2},null,null,{"$f":"IF(ISBLANK(Y8),\"\",Z121)","v":3},null,null,{"$f":"IF(ISBLANK(AB8),\"\",AC121)","v":4},null,null,{"$f":"IF(ISBLANK(AE8),\"\",AF121)","v":1},null,null,null,{"$f":"IF(ISBLANK(AI8),0,AJ121)","v":"00:00:00"}]
[null,null,"Pont/Összp.",{"$f":"IF(ISBLANK(D8),\"\",$C$87-E104+1)","v":1},{"$f":"D12","v":1},null,{"$f":"IF(ISBLANK(G8),\"\",$C$87-H104+1)","v":2},{"$f":"IF(ISBLANK(G8),\"\",SUM(E12,G12))","v":3},null,{"$f":"IF(ISBLANK(J8),\"\",$C$87-K104+1)","v":2},{"$f":"IF(ISBLANK(J8),\"\",SUM(H12,J12))","v":5},null,{"$f":"IF(ISBLANK(M8),\"\",$C$87-N104+1)","v":1},{"$f":"IF(ISBLANK(M8),\"\",SUM(K12,M12))","v":6},null,{"$f":"IF(ISBLANK(P8),\"\",$C$87-Q104+1)","v":5},{"$f":"IF(ISBLANK(P8),\"\",SUM(N12,P12))","v":11},null,{"$f":"IF(ISBLANK(S8),\"\",$C$87-T104+1)","v":2},{"$f":"IF(ISBLANK(S8),\"\",SUM(Q12,S12))","v":13},null,{"$f":"IF(ISBLANK(V8),\"\",$C$87-W104+1)","v":4},{"$f":"IF(ISBLANK(V8),\"\",SUM(T12,V12))","v":17},null,{"$f":"IF(ISBLANK(Y8),\"\",$C$87-Z104+1)","v":3},{"$f":"IF(ISBLANK(Y8),\"\",SUM(W12,Y12))","v":20},null,{"$f":"IF(ISBLANK(AB8),\"\",$C$87-AC104+1)","v":2},{"$f":"IF(ISBLANK(AB8),\"\",SUM(Z12,AB12))","v":22},null,{"$f":"IF(ISBLANK(AE8),\"\",$C$87-AF104+1)","v":5},{"$f":"IF(ISBLANK(AE8),\"\",SUM(AC12,AE12))","v":27}]
["3.","Hajdúböszörmény","Idő (p:mp:tmp):","00:02:10.900",null,{"$f":"IF(ISBLANK(D13),\"\",RANK(E17,(E$7,E$12,E$17,E$22,E$27,E$32,E$37,E$42,E$47,E$52,E$57,E$62),0))","v":4},"00:01:02.280",null,{"$f":"IF(ISBLANK(G13),\"\",RANK(H17,(H$7,H$12,H$17,H$22,H$27,H$32,H$37,H$42,H$47,H$52,H$57,H$62),0))","v":3},"00:02:24.770",null,{"$f":"IF(ISBLANK(J13),\"\",RANK(K17,(K$7,K$12,K$17,K$22,K$27,K$32,K$37,K$42,K$47,K$52,K$57,K$62),0))","v":3},"00:03:27.720",null,{"$f":"IF(ISBLANK(M13),\"\",RANK(N17,(N$7,N$12,N$17,N$22,N$27,N$32,N$37,N$42,N$47,N$52,N$57,N$62),0))","v":2},"00:00:22.620",null,{"$f":"IF(ISBLANK(P13),\"\",RANK(Q17,(Q$7,Q$12,Q$17,Q$22,Q$27,Q$32,Q$37,Q$42,Q$47,Q$52,Q$57,Q$62),0))","v":3},"00:01:31.610",null,{"$f":"IF(ISBLANK(S13),\"\",RANK(T17,(T$7,T$12,T$17,T$22,T$27,T$32,T$37,T$42,T$47,T$52,T$57,T$62),0))","v":3},"00:02:26.970",null,{"$f":"IF(ISBLANK(V13),\"\",RANK(W17,(W$7,W$12,W$17,W$22,W$27,W$32,W$37,W$42,W$47,W$52,W$57,W$62),0))","v":3},"00:01:45.330",null,{"$f":"IF(ISBLANK(Y13),\"\",RANK(Z17,(Z$7,Z$12,Z$17,Z$22,Z$27,Z$32,Z$37,Z$42,Z$47,Z$52,Z$57,Z$62),0))","v":3},"00:02:14.300",null,{"$f":"IF(ISBLANK(AB13),\"\",RANK(AC17,(AC$7,AC$12,AC$17,AC$22,AC$27,AC$32,AC$37,AC$42,AC$47,AC$52,AC$57,AC$62),0))","v":3},5,null,{"$f":"IF(ISBLANK(D13),\"\",SUM(D17,G17,J17,M17,P17,S17,V17,Y17,AB17,AE17,AE14)+IF(AI16=0,0,(($C$87-AI16+1)/1000)))","v":26},{"$f":"IF(ISBLANK(D13),\"\",RANK(AG13,($AG$3,$AG$8,$AG$13,$AG$18,$AG$23,$AG$28,$AG$33,$AG$38,$AG$43,$AG$48,$AG$53,$AG$58)))","v":4}]
[null,null,"Hiba (p:mp:tmp):",null,null,null,null,null,null,null,null,null,null,null,null,null,null,null,"00:00:04",null,null,"00:00:15",null,null,"00:00:02"]
[null,null,"Össz.idő",{"$f":"SUM(D13,D14)","v":"00:02:10.900"},null,null,{"$f":"SUM(G13,G14)","v":"00:01:02.280"},null,null,{"$f":"SUM(J13,J14)","v":"00:02:24.770"},null,null,{"$f":"SUM(M13,M14)","v":"00:03:27.720"},null,null,{"$f":"SUM(P13,P14)","v":"00:00:22.620"},null,null,{"$f":"SUM(S13,S14)","v":"00:01:35.610"},null,null,{"$f":"SUM(V13,V14)","v":"00:02:41.970"},null,null,{"$f":"SUM(Y13,Y14)","v":"00:01:47.330"},null,null,{"$f":"SUM(AB13,AB14)","v":"00:02:14.300"},null,null,{"$f":"AE13","v":5},null,null,null,{"$f":"SUM(AI13:AJ14)","v":"00:00:00"}]
[null,null,"Helyezés",{"$f":"IF(ISBLANK(D13),\"\",E122)","v":4},null,null,{"$f":"IF(ISBLANK(G13),\"\",H122)","v":1},null,null,{"$f":"IF(ISBLANK(J13),\"\",K122)","v":3},null,null,{"$f":"IF(ISBLANK(M13),\"\",N122)","v":1},null,null,{"$f":"IF(ISBLANK(P13),\"\",Q122)","v":5},null,null,{"$f":"IF(ISBLANK(S13),\"\",T122)","v":3},null,null,{"$f":"IF(ISBLANK(V13),\"\",W122)","v":5},null,null,{"$f":"IF(ISBLANK(Y13),\"\",Z122)","v":4},null,null,{"$f":"IF(ISBLANK(AB13),\"\",AC122)","v":3},null,null,{"$f":"IF(ISBLANK(AE13),\"\",AF122)","v":5},null,null,null,{"$f":"IF(ISBLANK(AI13),0,AJ122)","v":"00:00:00"}]
[null,null,"Pont/Összp.",{"$f":"IF(ISBLANK(D13),\"\",$C$87-E105+1)","v":2},{"$f":"D17","v":2},null,{"$f":"IF(ISBLANK(G13),\"\",$C$87-H105+1)","v":5},{"$f":"IF(ISBLANK(G13),\"\",SUM(E17,G17))","v":7},null,{"$f":"IF(ISBLANK(J13),\"\",$C$87-K105+1)","v":3},{"$f":"IF(ISBLANK(J13),\"\",SUM(H17,J17))","v":10},null,{"$f":"IF(ISBLANK(M13),\"\",$C$87-N105+1)","v":5},{"$f":"IF(ISBLANK(M13),\"\",SUM(K17,M17))","v":15},null,{"$f":"IF(ISBLANK(P13),\"\",$C$87-Q105+1)","v":1},{"$f":"IF(ISBLANK(P13),\"\",SUM(N17,P17))","v":16},null,{"$f":"IF(ISBLANK(S13),\"\",$C$87-T105+1)","v":3},{"$f":"IF(ISBLANK(S13),\"\",SUM(Q17,S17))","v":19},null,{"$f":"IF(ISBLANK(V13),\"\",$C$87-W105+1)","v":1},{"$f":"IF(ISBLANK(V13),\"\",SUM(T17,V17))","v":20},null,{"$f":"IF(ISBLANK(Y13),\"\",$C$87-Z105+1)","v":2},{"$f":"IF(ISBLANK(Y13),\"\",SUM(W17,Y17))","v":22},null,{"$f":"IF(ISBLANK(AB13),\"\",$C$87-AC105+1)","v":3},{"$f":"IF(ISBLANK(AB13),\"\",SUM(Z17,AB17))","v":25},null,{"$f":"IF(ISBLANK(AE13),\"\",$C$87-AF105+1)","v":1},{"$f":"IF(ISBLANK(AE13),\"\",SUM(AC17,AE17))","v":26}]
["4.","Törökbálint","Idő (p:mp:tmp):","00:02:06.220",null,{"$f":"IF(ISBLANK(D18),\"\",RANK(E22,(E$7,E$12,E$17,E$22,E$27,E$32,E$37,E$42,E$47,E$52,E$57,E$62),0))","v":1},"00:01:05.930",null,{"$f":"IF(ISBLANK(G18),\"\",RANK(H22,(H$7,H$12,H$17,H$22,H$27,H$32,H$37,H$42,H$47,H$52,H$57,H$62),0))","v":1},"00:02:19.580",null,{"$f":"IF(ISBLANK(J18),\"\",RANK(K22,(K$7,K$12,K$17,K$22,K$27,K$32,K$37,K$42,K$47,K$52,K$57,K$62),0))","v":2},"00:03:35.420",null,{"$f":"IF(ISBLANK(M18),\"\",RANK(N22,(N$7,N$12,N$17,N$22,N$27,N$32,N$37,N$42,N$47,N$52,N$57,N$62),0))","v":2},"00:00:21.350",null,{"$f":"IF(ISBLANK(P18),\"\",RANK(Q22,(Q$7,Q$12,Q$17,Q$22,Q$27,Q$32,Q$37,Q$42,Q$47,Q$52,Q$57,Q$62),0))","v":2},"00:01:33.070",null,{"$f":"IF(ISBLANK(S18),\"\",RANK(T22,(T$7,T$12,T$17,T$22,T$27,T$32,T$37,T$42,T$47,T$52,T$57,T$62),0))","v":2},"00:02:29.330",null,{"$f":"IF(ISBLANK(V18),\"\",RANK(W22,(W$7,W$12,W$17,W$22,W$27,W$32,W$37,W$42,W$47,W$52,W$57,W$62),0))","v":1},"00:01:38.580",null,{"$f":"IF(ISBLANK(Y18),\"\",RANK(Z22,(Z$7,Z$12,Z$17,Z$22,Z$27,Z$32,Z$37,Z$42,Z$47,Z$52,Z$57,Z$62),0))","v":2},"00:02:10.680",null,{"$f":"IF(ISBLANK(AB18),\"\",RANK(AC22,(AC$7,AC$12,AC$17,AC$22,AC$27,AC$32,AC$37,AC$42,AC$47,AC$52,AC$57,AC$62),0))","v":2},4,null,{"$f":"IF(ISBLANK(D18),\"\",SUM(D22,G22,J22,M22,P22,S22,V22,Y22,AB22,AE22,AE19)+IF(AI21=0,0,(($C$87-AI21+1)/1000)))","v":38},{"$f":"IF(ISBLANK(D18),\"\",RANK(AG18,($AG$3,$AG$8,$AG$13,$AG$18,$AG$23,$AG$28,$AG$33,$AG$38,$AG$43,$AG$48,$AG$53,$AG$58)))","v":2}]
[null,null,"Hiba (p:mp:tmp):","00:00:01",null,null,"00:00:01",null,null,null,null,null,"00:00:02",null,null,null,null,null,null,null,null,null,null,null,null,null,null,"00:00:02"]
[null,null,"Össz.idő",{"$f":"SUM(D18,D19)","v":"00:02:07.220"},null,null,{"$f":"SUM(G18,G19)","v":"00:01:06.930"},null,null,{"$f":"SUM(J18,J19)","v":"00:02:19.580"},null,null,{"$f":"SUM(M18,M19)","v":"00:03:37.420"},null,null,{"$f":"SUM(P18,P19)","v":"00:00:21.350"},null,null,{"$f":"SUM(S18,S19)","v":"00:01:33.070"},null,null,{"$f":"SUM(V18,V19)","v":"00:02:29.330"},null,null,{"$f":"SUM(Y18,Y19)","v":"00:01:38.580"},null,null,{"$f":"SUM(AB18,AB19)","v":"00:02:12.680"},null,null,{"$f":"AE18","v":4},null,null,null,{"$f":"SUM(AI18:AJ19)","v":"00:00:00"}]
[null,null,"Helyezés",{"$f":"IF(ISBLANK(D18),\"\",E123)","v":1},null,null,{"$f":"IF(ISBLANK(G18),\"\",H123)","v":3},null,null,{"$f":"IF(ISBLANK(J18),\"\",K123)","v":2},null,null,{"$f":"IF(ISBLANK(M18),\"\",N123)","v":3},null,null,{"$f":"IF(ISBLANK(P18),\"\",Q123)","v":2},null,null,{"$f":"IF(ISBLANK(S18),\"\",T123)","v":2},null,null,{"$f":"IF(ISBLANK(V18),\"\",W123)","v":1},null,null,{"$f":"IF(ISBLANK(Y18),\"\",Z123)","v":2},null,null,{"$f":"IF(ISBLANK(AB18),\"\",AC123)","v":2},null,null,{"$f":"IF(ISBLANK(AE18),\"\",AF123)","v":4},null,null,null,{"$f":"IF(ISBLANK(AI18),0,AJ123)","v":"00:00:00"}]
[null,null,"Pont/Összp.",{"$f":"IF(ISBLANK(D18),\"\",$C$87-E106+1)","v":5},{"$f":"D22","v":5},null,{"$f":"IF(ISBLANK(G18),\"\",$C$87-H106+1)","v":3},{"$f":"IF(ISBLANK(G18),\"\",SUM(E22,G22))","v":8},null,{"$f":"IF(ISBLANK(J18),\"\",$C$87-K106+1)","v":4},{"$f":"IF(ISBLANK(J18),\"\",SUM(H22,J22))","v":12},null,{"$f":"IF(ISBLANK(M18),\"\",$C$87-N106+1)","v":3},{"$f":"IF(ISBLANK(M18),\"\",SUM(K22,M22))","v":15},null,{"$f":"IF(ISBLANK(P18),\"\",$C$87-Q106+1)","v":4},{"$f":"IF(ISBLANK(P18),\"\",SUM(N22,P22))","v":19},null,{"$f":"IF(ISBLANK(S18),\"\",$C$87-T106+1)","v":4},{"$f":"IF(ISBLANK(S18),\"\",SUM(Q22,S22))","v":23},null,{"$f":"IF(ISBLANK(V18),\"\",$C$87-W106+1)","v":5},{"$f":"IF(ISBLANK(V18),\"\",SUM(T22,V22))","v":28},null,{"$f":"IF(ISBLANK(Y18),\"\",$C$87-Z106+1)","v":4},{"$f":"IF(ISBLANK(Y18),\"\",SUM(W22,Y22))","v":32},null,{"$f":"IF(ISBLANK(AB18),\"\",$C$87-AC106+1)","v":4},{"$f":"IF(ISBLANK(AB18),\"\",SUM(Z22,AB22))","v":36},null,{"$f":"IF(ISBLANK(AE18),\"\",$C$87-AF106+1)","v":2},{"$f":"IF(ISBLANK(AE18),\"\",SUM(AC22,AE22))","v":38}]
["5.","Szombathely","Idő (p:mp:tmp):","00:02:08.130",null,{"$f":"IF(ISBLANK(D23),\"\",RANK(E27,(E$7,E$12,E$17,E$22,E$27,E$32,E$37,E$42),0))","v":2},"00:01:03.490",null,{"$f":"IF(ISBLANK(G23),\"\",RANK(H27,(H$7,H$12,H$17,H$22,H$27,H$32,H$37,H$42),0))","v":1},"00:02:18.380",null,{"$f":"IF(ISBLANK(J23),\"\",RANK(K27,(K$7,K$12,K$17,K$22,K$27,K$32,K$37,K$42),0))","v":1},"00:03:25.620",null,{"$f":"IF(ISBLANK(M23),\"\",RANK(N27,(N$7,N$12,N$17,N$22,N$27,N$32,N$37,N$42),0))","v":1},"00:00:21.960",null,{"$f":"IF(ISBLANK(P23),\"\",RANK(Q27,(Q$7,Q$12,Q$17,Q$22,Q$27,Q$32,Q$37,Q$42),0))","v":1},"00:01:31.850",null,{"$f":"IF(ISBLANK(S23),\"\",RANK(T27,(T$7,T$12,T$17,T$22,T$27,T$32,T$37,T$42),0))","v":1},"00:02:32.380",null,{"$f":"IF(ISBLANK(V23),\"\",RANK(W27,(W$7,W$12,W$17,W$22,W$27,W$32,W$37,W$42),0))","v":1},"00:01:33.480",null,{"$f":"IF(ISBLANK(Y23),\"\",RANK(Z27,(Z$7,Z$12,Z$17,Z$22,Z$27,Z$32,Z$37,Z$42),0))","v":1},"00:02:11.830",null,{"$f":"IF(ISBLANK(AB23),\"\",RANK(AC27,(AC$7,AC$12,AC$17,AC$22,AC$27,AC$32,AC$37,AC$42),0))","v":1},3,null,{"$f":"IF(ISBLANK(D23),\"\",SUM(D27,G27,J27,M27,P27,S27,V27,Y27,AB27,AE27,AE24)+IF(AI26=0,0,(($C$87-AI26+1)/1000)))","v":41},{"$f":"IF(ISBLANK(D23),\"\",RANK(AG23,($AG$3,$AG$8,$AG$13,$AG$18,$AG$23,$AG$28,$AG$33,$AG$38,$AG$43,$AG$48,$AG$53,$AG$58)))","v":1}]
[null,null,"Hiba (p:mp:tmp):",null,null,null,null,null,null,null,null,null,"00:00:04",null,null,null,null,null,null,null,null,null,null,null,"00:00:02"]
[null,null,"Össz.idő",{"$f":"SUM(D23,D24)","v":"00:02:08.130"},null,null,{"$f":"SUM(G23,G24)","v":"00:01:03.490"},null,null,{"$f":"SUM(J23,J24)","v":"00:02:18.380"},null,null,{"$f":"SUM(M23,M24)","v":"00:03:29.620"},null,null,{"$f":"SUM(P23,P24)","v":"00:00:21.960"},null,null,{"$f":"SUM(S23,S24)","v":"00:01:31.850"},null,null,{"$f":"SUM(V23,V24)","v":"00:02:32.380"},null,null,{"$f":"SUM(Y23,Y24)","v":"00:01:35.480"},null,null,{"$f":"SUM(AB23,AB24)","v":"00:02:11.830"},null,null,{"$f":"AE23","v":3},null,null,null,{"$f":"SUM(AI23:AJ24)","v":"00:00:00"}]
[null,null,"Helyezés",{"$f":"IF(ISBLANK(D23),\"\",E124)","v":2},null,null,{"$f":"IF(ISBLANK(G23),\"\",H124)","v":2},null,null,{"$f":"IF(ISBLANK(J23),\"\",K124)","v":1},null,null,{"$f":"IF(ISBLANK(M23),\"\",N124)","v":2},null,null,{"$f":"IF(ISBLANK(P23),\"\",Q124)","v":3},null,null,{"$f":"IF(ISBLANK(S23),\"\",T124)","v":1},null,null,{"$f":"IF(ISBLANK(V23),\"\",W124)","v":3},null,null,{"$f":"IF(ISBLANK(Y23),\"\",Z124)","v":1},null,null,{"$f":"IF(ISBLANK(AB23),\"\",AC124)","v":1},null,null,{"$f":"IF(ISBLANK(AE23),\"\",AF124)","v":3},null,null,null,{"$f":"IF(ISBLANK(AI23),0,AJ124)","v":"00:00:00"}]
[null,null,"Pont/Összp.",{"$f":"IF(ISBLANK(D23),\"\",$C$87-E107+1)","v":4},{"$f":"D27","v":4},null,{"$f":"IF(ISBLANK(G23),\"\",$C$87-H107+1)","v":4},{"$f":"IF(ISBLANK(G23),\"\",SUM(E27,G27))","v":8},null,{"$f":"IF(ISBLANK(J23),\"\",$C$87-K107+1)","v":5},{"$f":"IF(ISBLANK(J23),\"\",SUM(H27,J27))","v":13},null,{"$f":"IF(ISBLANK(M23),\"\",$C$87-N107+1)","v":4},{"$f":"IF(ISBLANK(M23),\"\",SUM(K27,M27))","v":17},null,{"$f":"IF(ISBLANK(P23),\"\",$C$87-Q107+1)","v":3},{"$f":"IF(ISBLANK(P23),\"\",SUM(N27,P27))","v":20},null,{"$f":"IF(ISBLANK(S23),\"\",$C$87-T107+1)","v":5},{"$f":"IF(ISBLANK(S23),\"\",SUM(Q27,S27))","v":25},null,{"$f":"IF(ISBLANK(V23),\"\",$C$87-W107+1)","v":3},{"$f":"IF(ISBLANK(V23),\"\",SUM(T27,V27))","v":28},null,{"$f":"IF(ISBLANK(Y23),\"\",$C$87-Z107+1)","v":5},{"$f":"IF(ISBLANK(Y23),\"\",SUM(W27,Y27))","v":33},null,{"$f":"IF(ISBLANK(AB23),\"\",$C$87-AC107+1)","v":5},{"$f":"IF(ISBLANK(AB23),\"\",SUM(Z27,AB27))","v":38},null,{"$f":"IF(ISBLANK(AE23),\"\",$C$87-AF107+1)","v":3},{"$f":"IF(ISBLANK(AE23),\"\",SUM(AC27,AE27))","v":41}]
["6.",null,"Idő (p:mp:tmp):",null,null,{"$f":"IF(ISBLANK(D28),\"\",RANK(E32,(E$7,E$12,E$17,E$22,E$27,E$32,E$37,E$42,E$47,E$52,E$57,E$62),0))","v":""},null,null,{"$f":"IF(ISBLANK(G28),\"\",RANK(H32,(H$7,H$12,H$17,H$22,H$27,H$32,H$37,H$42,H$47,H$52,H$57,H$62),0))","v":""},null,null,{"$f":"IF(ISBLANK(J28),\"\",RANK(K32,(K$7,K$12,K$17,K$22,K$27,K$32,K$37,K$42,K$47,K$52,K$57,K$62),0))","v":""},null,null,{"$f":"IF(ISBLANK(M28),\"\",RANK(N32,(N$7,N$12,N$17,N$22,N$27,N$32,N$37,N$42,N$47,N$52,N$57,N$62),0))","v":""},null,null,{"$f":"IF(ISBLANK(P28),\"\",RANK(Q32,(Q$7,Q$12,Q$17,Q$22,Q$27,Q$32,Q$37,Q$42,Q$47,Q$52,Q$57,Q$62),0))","v":""},null,null,{"$f":"IF(ISBLANK(S28),\"\",RANK(T32,(T$7,T$12,T$17,T$22,T$27,T$32,T$37,T$42,T$47,T$52,T$57,T$62),0))","v":""},null,null,{"$f":"IF(ISBLANK(V28),\"\",RANK(W32,(W$7,W$12,W$17,W$22,W$27,W$32,W$37,W$42,W$47,W$52,W$57,W$62),0))","v":""},null,null,{"$f":"IF(ISBLANK(Y28),\"\",RANK(Z32,(Z$7,Z$12,Z$17,Z$22,Z$27,Z$32,Z$37,Z$42,Z$47,Z$52,Z$57,Z$62),0))","v":""},null,null,{"$f":"IF(ISBLANK(AB28),\"\",RANK(AC32,(AC$7,AC$12,AC$17,AC$22,AC$27,AC$32,AC$37,AC$42,AC$47,AC$52,AC$57,AC$62),0))","v":""},null,null,{"$f":"IF(ISBLANK(D28),\"\",SUM(D32,G32,J32,M32,P32,S32,V32,Y32,AB32,AE32,AE29)+IF(AI31=0,0,(($C$87-AI31+1)/1000)))","v":""},{"$f":"IF(ISBLANK(D28),\"\",RANK(AG28,($AG$3,$AG$8,$AG$13,$AG$18,$AG$23,$AG$28,$AG$33,$AG$38,$AG$43,$AG$48,$AG$53,$AG$58)))","v":""}]
[null,null,"Hiba (p:mp:tmp):"]
[null,null,"Össz.idő",{"$f":"SUM(D28,D29)","v":"00:00:00"},null,null,{"$f":"SUM(G28,G29)","v":"00:00:00"},null,null,{"$f":"SUM(J28,J29)","v":"00:00:00"},null,null,{"$f":"SUM(M28,M29)","v":"00:00:00"},null,null,{"$f":"SUM(P28,P29)","v":"00:00:00"},null,null,{"$f":"SUM(S28,S29)","v":"00:00:00"},null,null,{"$f":"SUM(V28,V29)","v":"00:00:00"},null,null,{"$f":"SUM(Y28,Y29)","v":"00:00:00"},null,null,{"$f":"SUM(AB28,AB29)","v":"00:00:00"},null,null,{"$f":"AE28","v":0},null,null,null,{"$f":"SUM(AI28:AJ29)","v":"00:00:00"}]
[null,null,"Helyezés",{"$f":"IF(ISBLANK(D28),\"\",E125)","v":""},null,null,{"$f":"IF(ISBLANK(G28),\"\",H125)","v":""},null,null,{"$f":"IF(ISBLANK(J28),\"\",K125)","v":""},null,null,{"$f":"IF(ISBLANK(M28),\"\",N125)","v":""},null,null,{"$f":"IF(ISBLANK(P28),\"\",Q125)","v":""},null,null,{"$f":"IF(ISBLANK(S28),\"\",T125)","v":""},null,null,{"$f":"IF(ISBLANK(V28),\"\",W125)","v":""},null,null,{"$f":"IF(ISBLANK(Y28),\"\",Z125)","v":""},null,null,{"$f":"IF(ISBLANK(AB28),\"\",AC125)","v":""},null,null,{"$f":"IF(ISBLANK(AE28),\"\",AF125)","v":""},null,null,null,{"$f":"IF(ISBLANK(AI28),0,AJ125)","v":"00:00:00"}]
[null,null,"Pont/Összp.",{"$f":"IF(ISBLANK(D28),\"\",$C$87-E108+1)","v":""},{"$f":"D32","v":""},null,{"$f":"IF(ISBLANK(G28),\"\",$C$87-H108+1)","v":""},{"$f":"IF(ISBLANK(G28),\"\",SUM(E32,G32))","v":""},null,{"$f":"IF(ISBLANK(J28),\"\",$C$87-K108+1)","v":""},{"$f":"IF(ISBLANK(J28),\"\",SUM(H32,J32))","v":""},null,{"$f":"IF(ISBLANK(M28),\"\",$C$87-N108+1)","v":""},{"$f":"IF(ISBLANK(M28),\"\",SUM(K32,M32))","v":""},null,{"$f":"IF(ISBLANK(P28),\"\",$C$87-Q108+1)","v":""},{"$f":"IF(ISBLANK(P28),\"\",SUM(N32,P32))","v":""},null,{"$f":"IF(ISBLANK(S28),\"\",$C$87-T108+1)","v":""},{"$f":"IF(ISBLANK(S28),\"\",SUM(Q32,S32))","v":""},null,{"$f":"IF(ISBLANK(V28),\"\",$C$87-W108+1)","v":""},{"$f":"IF(ISBLANK(V28),\"\",SUM(T32,V32))","v":""},null,{"$f":"IF(ISBLANK(Y28),\"\",$C$87-Z108+1)","v":""},{"$f":"IF(ISBLANK(Y28),\"\",SUM(W32,Y32))","v":""},null,{"$f":"IF(ISBLANK(AB28),\"\",$C$87-AC108+1)","v":""},{"$f":"IF(ISBLANK(AB28),\"\",SUM(Z32,AB32))","v":""},null,{"$f":"IF(ISBLANK(AE28),\"\",$C$87-AF108+1)","v":""},{"$f":"IF(ISBLANK(AE28),\"\",SUM(AC32,AE32))","v":""}]
["7.",null,"Idő (p:mp:tmp):",null,null,{"$f":"IF(ISBLANK(D33),\"\",RANK(E37,(E$7,E$12,E$17,E$22,E$27,E$32,E$37,E$42,E$47,E$52,E$57,E$62),0))","v":""},null,null,{"$f":"IF(ISBLANK(G33),\"\",RANK(H37,(H$7,H$12,H$17,H$22,H$27,H$32,H$37,H$42,H$47,H$52,H$57,H$62),0))","v":""},null,null,{"$f":"IF(ISBLANK(J33),\"\",RANK(K37,(K$7,K$12,K$17,K$22,K$27,K$32,K$37,K$42,K$47,K$52,K$57,K$62),0))","v":""},null,null,{"$f":"IF(ISBLANK(M33),\"\",RANK(N37,(N$7,N$12,N$17,N$22,N$27,N$32,N$37,N$42,N$47,N$52,N$57,N$62),0))","v":""},null,null,{"$f":"IF(ISBLANK(P33),\"\",RANK(Q37,(Q$7,Q$12,Q$17,Q$22,Q$27,Q$32,Q$37,Q$42,Q$47,Q$52,Q$57,Q$62),0))","v":""},null,null,{"$f":"IF(ISBLANK(S33),\"\",RANK(T37,(T$7,T$12,T$17,T$22,T$27,T$32,T$37,T$42,T$47,T$52,T$57,T$62),0))","v":""},null,null,{"$f":"IF(ISBLANK(V33),\"\",RANK(W37,(W$7,W$12,W$17,W$22,W$27,W$32,W$37,W$42,W$47,W$52,W$57,W$62),0))","v":""},null,null,{"$f":"IF(ISBLANK(Y33),\"\",RANK(Z37,(Z$7,Z$12,Z$17,Z$22,Z$27,Z$32,Z$37,Z$42,Z$47,Z$52,Z$57,Z$62),0))","v":""},null,null,{"$f":"IF(ISBLANK(AB33),\"\",RANK(AC37,(AC$7,AC$12,AC$17,AC$22,AC$27,AC$32,AC$37,AC$42,AC$47,AC$52,AC$57,AC$62),0))","v":""},null,null,{"$f":"IF(ISBLANK(D33),\"\",SUM(D37,G37,J37,M37,P37,S37,V37,Y37,AB37,AE37,AE34)+IF(AI36=0,0,(($C$87-AI36+1)/1000)))","v":""},{"$f":"IF(ISBLANK(D33),\"\",RANK(AG33,($AG$3,$AG$8,$AG$13,$AG$18,$AG$23,$AG$28,$AG$33,$AG$38,$AG$43,$AG$48,$AG$53,$AG$58)))","v":""}]
[null,null,"Hiba (p:mp:tmp):"]
[null,null,"Össz.idő",{"$f":"SUM(D33,D34)","v":"00:00:00"},null,null,{"$f":"SUM(G33,G34)","v":"00:00:00"},null,null,{"$f":"SUM(J33,J34)","v":"00:00:00"},null,null,{"$f":"SUM(M33,M34)","v":"00:00:00"},null,null,{"$f":"SUM(P33,P34)","v":0},null,null,{"$f":"SUM(S33,S34)","v":"00:00:00"},null,null,{"$f":"SUM(V33,V34)","v":"00:00:00"},null,null,{"$f":"SUM(Y33,Y34)","v":"00:00:00"},null,null,{"$f":"SUM(AB33,AB34)","v":"00:00:00"},null,null,{"$f":"AE33","v":0},null,null,null,{"$f":"SUM(AI33:AJ34)","v":"00:00:00"}]
[null,null,"Helyezés",{"$f":"IF(ISBLANK(D33),\"\",E126)","v":""},null,null,{"$f":"IF(ISBLANK(G33),\"\",H126)","v":""},null,null,{"$f":"IF(ISBLANK(J33),\"\",K126)","v":""},null,null,{"$f":"IF(ISBLANK(M33),\"\",N126)","v":""},null,null,{"$f":"IF(ISBLANK(P33),\"\",Q126)","v":""},null,null,{"$f":"IF(ISBLANK(S33),\"\",T126)","v":""},null,null,{"$f":"IF(ISBLANK(V33),\"\",W126)","v":""},null,null,{"$f":"IF(ISBLANK(Y33),\"\",Z126)","v":""},null,null,{"$f":"IF(ISBLANK(AB33),\"\",AC126)","v":""},null,null,{"$f":"IF(ISBLANK(AE33),\"\",AF126)","v":""},null,null,null,{"$f":"IF(ISBLANK(AI33),0,AJ126)","v":"00:00:00"}]
[null,null,"Pont/Összp.",{"$f":"IF(ISBLANK(D33),\"\",$C$87-E109+1)","v":""},{"$f":"D37","v":""},null,{"$f":"IF(ISBLANK(G33),\"\",$C$87-H109+1)","v":""},{"$f":"IF(ISBLANK(G33),\"\",SUM(E37,G37))","v":""},null,{"$f":"IF(ISBLANK(J33),\"\",$C$87-K109+1)","v":""},{"$f":"IF(ISBLANK(J33),\"\",SUM(H37,J37))","v":""},null,{"$f":"IF(ISBLANK(M33),\"\",$C$87-N109+1)","v":""},{"$f":"IF(ISBLANK(M33),\"\",SUM(K37,M37))","v":""},null,{"$f":"IF(ISBLANK(P33),\"\",$C$87-Q109+1)","v":""},{"$f":"IF(ISBLANK(P33),\"\",SUM(N37,P37))","v":""},null,{"$f":"IF(ISBLANK(S33),\"\",$C$87-T109+1)","v":""},{"$f":"IF(ISBLANK(S33),\"\",SUM(Q37,S37))","v":""},null,{"$f":"IF(ISBLANK(V33),\"\",$C$87-W109+1)","v":""},{"$f":"IF(ISBLANK(V33),\"\",SUM(T37,V37))","v":""},null,{"$f":"IF(ISBLANK(Y33),\"\",$C$87-Z109+1)","v":""},{"$f":"IF(ISBLANK(Y33),\"\",SUM(W37,Y37))","v":""},null,{"$f":"IF(ISBLANK(AB33),\"\",$C$87-AC109+1)","v":""},{"$f":"IF(ISBLANK(AB33),\"\",SUM(Z37,AB37))","v":""},null,{"$f":"IF(ISBLANK(AE33),\"\",$C$87-AF109+1)","v":""},{"$f":"IF(ISBLANK(AE33),\"\",SUM(AC37,AE37))","v":""}]
["8.",null,"Idő (p:mp:tmp):",null,null,{"$f":"IF(ISBLANK(D38),\"\",RANK(E42,(E$7,E$12,E$17,E$22,E$27,E$32,E$37,E$42,E$47,E$52,E$57,E$62),0))","v":""},null,null,{"$f":"IF(ISBLANK(G38),\"\",RANK(H42,(H$7,H$12,H$17,H$22,H$27,H$32,H$37,H$42,H$47,H$52,H$57,H$62),0))","v":""},null,null,{"$f":"IF(ISBLANK(J38),\"\",RANK(K42,(K$7,K$12,K$17,K$22,K$27,K$32,K$37,K$42,K$47,K$52,K$57,K$62),0))","v":""},null,null,{"$f":"IF(ISBLANK(M38),\"\",RANK(N42,(N$7,N$12,N$17,N$22,N$27,N$32,N$37,N$42,N$47,N$52,N$57,N$62),0))","v":""},null,null,{"$f":"IF(ISBLANK(P38),\"\",RANK(Q42,(Q$7,Q$12,Q$17,Q$22,Q$27,Q$32,Q$37,Q$42,Q$47,Q$52,Q$57,Q$62),0))","v":""},null,null,{"$f":"IF(ISBLANK(S38),\"\",RANK(T42,(T$7,T$12,T$17,T$22,T$27,T$32,T$37,T$42,T$47,T$52,T$57,T$62),0))","v":""},null,null,{"$f":"IF(ISBLANK(V38),\"\",RANK(W42,(W$7,W$12,W$17,W$22,W$27,W$32,W$37,W$42,W$47,W$52,W$57,W$62),0))","v":""},null,null,{"$f":"IF(ISBLANK(Y38),\"\",RANK(Z42,(Z$7,Z$12,Z$17,Z$22,Z$27,Z$32,Z$37,Z$42,Z$47,Z$52,Z$57,Z$62),0))","v":""},null,null,{"$f":"IF(ISBLANK(AB38),\"\",RANK(AC42,(AC$7,AC$12,AC$17,AC$22,AC$27,AC$32,AC$37,AC$42,AC$47,AC$52,AC$57,AC$62),0))","v":""},null,null,{"$f":"IF(ISBLANK(D38),\"\",SUM(D42,G42,J42,M42,P42,S42,V42,Y42,AB42,AE42,AE39)+IF(AI41=0,0,(($C$87-AI41+1)/1000)))","v":""},{"$f":"IF(ISBLANK(D38),\"\",RANK(AG38,($AG$3,$AG$8,$AG$13,$AG$18,$AG$23,$AG$28,$AG$33,$AG$38,$AG$43,$AG$48,$AG$53,$AG$58)))","v":""}]
[null,null,"Hiba (p:mp:tmp):"]
[null,null,"Össz.idő",{"$f":"SUM(D38,D39)","v":"00:00:00"},null,null,{"$f":"SUM(G38,G39)","v":"00:00:00"},null,null,{"$f":"SUM(J38,J39)","v":"00:00:00"},null,null,{"$f":"SUM(M38,M39)","v":"00:00:00"},null,null,{"$f":"SUM(P38,P39)","v":0},null,null,{"$f":"SUM(S38,S39)","v":"00:00:00"},null,null,{"$f":"SUM(V38,V39)","v":"00:00:00"},null,null,{"$f":"SUM(Y38,Y39)","v":"00:00:00"},null,null,{"$f":"SUM(AB38,AB39)","v":"00:00:00"},null,null,{"$f":"AE38","v":0},null,null,null,{"$f":"SUM(AI38:AJ39)","v":"00:00:00"}]
[null,null,"Helyezés",{"$f":"IF(ISBLANK(D38),\"\",E127)","v":""},null,null,{"$f":"IF(ISBLANK(G38),\"\",H127)","v":""},null,null,{"$f":"IF(ISBLANK(J38),\"\",K127)","v":""},null,null,{"$f":"IF(ISBLANK(M38),\"\",N127)","v":""},null,null,{"$f":"IF(ISBLANK(P38),\"\",Q127)","v":""},null,null,{"$f":"IF(ISBLANK(S38),\"\",T127)","v":""},null,null,{"$f":"IF(ISBLANK(V38),\"\",W127)","v":""},null,null,{"$f":"IF(ISBLANK(Y38),\"\",Z127)","v":""},null,null,{"$f":"IF(ISBLANK(AB38),\"\",AC127)","v":""},null,null,{"$f":"IF(ISBLANK(AE38),\"\",AF127)","v":""},null,null,null,{"$f":"IF(ISBLANK(AI38),0,AJ127)","v":"00:00:00"}]
[null,null,"Pont/Összp.",{"$f":"IF(ISBLANK(D38),\"\",$C$87-E110+1)","v":""},{"$f":"D42","v":""},null,{"$f":"IF(ISBLANK(G38),\"\",$C$87-H110+1)","v":""},{"$f":"IF(ISBLANK(G38),\"\",SUM(E42,G42))","v":""},null,{"$f":"IF(ISBLANK(J38),\"\",$C$87-K110+1)","v":""},{"$f":"IF(ISBLANK(J38),\"\",SUM(H42,J42))","v":""},null,{"$f":"IF(ISBLANK(M38),\"\",$C$87-N110+1)","v":""},{"$f":"IF(ISBLANK(M38),\"\",SUM(K42,M42))","v":""},null,{"$f":"IF(ISBLANK(P38),\"\",$C$87-Q110+1)","v":""},{"$f":"IF(ISBLANK(P38),\"\",SUM(N42,P42))","v":""},null,{"$f":"IF(ISBLANK(S38),\"\",$C$87-T110+1)","v":""},{"$f":"IF(ISBLANK(S38),\"\",SUM(Q42,S42))","v":""},null,{"$f":"IF(ISBLANK(V38),\"\",$C$87-W110+1)","v":""},{"$f":"IF(ISBLANK(V38),\"\",SUM(T42,V42))","v":""},null,{"$f":"IF(ISBLANK(Y38),\"\",$C$87-Z110+1)","v":""},{"$f":"IF(ISBLANK(Y38),\"\",SUM(W42,Y42))","v":""},null,{"$f":"IF(ISBLANK(AB38),\"\",$C$87-AC110+1)","v":""},{"$f":"IF(ISBLANK(AB38),\"\",SUM(Z42,AB42))","v":""},null,{"$f":"IF(ISBLANK(AE38),\"\",$C$87-AF110+1)","v":""},{"$f":"IF(ISBLANK(AE38),\"\",SUM(AC42,AE42))","v":""}]
["9.",null,"Idő (p:mp:tmp):",null,null,{"$f":"IF(ISBLANK(D43),\"\",RANK(E47,(E$7,E$12,E$17,E$22,E$27,E$32,E$37,E$42,E$47,E$52,E$57,E$62),0))","v":""},null,null,{"$f":"IF(ISBLANK(G43),\"\",RANK(H47,(H$7,H$12,H$17,H$22,H$27,H$32,H$37,H$42,H$47,H$52,H$57,H$62),0))","v":""},null,null,{"$f":"IF(ISBLANK(J43),\"\",RANK(K47,(K$7,K$12,K$17,K$22,K$27,K$32,K$37,K$42,K$47,K$52,K$57,K$62),0))","v":""},null,null,{"$f":"IF(ISBLANK(M43),\"\",RANK(N47,(N$7,N$12,N$17,N$22,N$27,N$32,N$37,N$42,N$47,N$52,N$57,N$62),0))","v":""},null,null,{"$f":"IF(ISBLANK(P43),\"\",RANK(Q47,(Q$7,Q$12,Q$17,Q$22,Q$27,Q$32,Q$37,Q$42,Q$47,Q$52,Q$57,Q$62),0))","v":""},null,null,{"$f":"IF(ISBLANK(S43),\"\",RANK(T47,(T$7,T$12,T$17,T$22,T$27,T$32,T$37,T$42,T$47,T$52,T$57,T$62),0))","v":""},null,null,{"$f":"IF(ISBLANK(V43),\"\",RANK(W47,(W$7,W$12,W$17,W$22,W$27,W$32,W$37,W$42,W$47,W$52,W$57,W$62),0))","v":""},null,null,{"$f":"IF(ISBLANK(Y43),\"\",RANK(Z47,(Z$7,Z$12,Z$17,Z$22,Z$27,Z$32,Z$37,Z$42,Z$47,Z$52,Z$57,Z$62),0))","v":""},null,null,{"$f":"IF(ISBLANK(AB43),\"\",RANK(AC47,(AC$7,AC$12,AC$17,AC$22,AC$27,AC$32,AC$37,AC$42,AC$47,AC$52,AC$57,AC$62),0))","v":""},null,null,{"$f":"IF(ISBLANK(D43),\"\",SUM(D47,G47,J47,M47,P47,S47,V47,Y47,AB47,AE47,AE44)+IF(AI46=0,0,(($C$87-AI46+1)/1000)))","v":""},{"$f":"IF(ISBLANK(D43),\"\",RANK(AG43,($AG$3,$AG$8,$AG$13,$AG$18,$AG$23,$AG$28,$AG$33,$AG$38,$AG$43,$AG$48,$AG$53,$AG$58)))","v":""}]
[null,null,"Hiba (p:mp:tmp):"]
[null,null,"Össz.idő",{"$f":"SUM(D43,D44)","v":"00:00:00"},null,null,{"$f":"SUM(G43,G44)","v":"00:00:00"},null,null,{"$f":"SUM(J43,J44)","v":"00:00:00"},null,null,{"$f":"SUM(M43,M44)","v":"00:00:00"},null,null,{"$f":"SUM(P43,P44)","v":0},null,null,{"$f":"SUM(S43,S44)","v":"00:00:00"},null,null,{"$f":"SUM(V43,V44)","v":"00:00:00"},null,null,{"$f":"SUM(Y43,Y44)","v":"00:00:00"},null,null,{"$f":"SUM(AB43,AB44)","v":"00:00:00"},null,null,{"$f":"AE43","v":0},null,null,null,{"$f":"SUM(AI43:AJ44)","v":"00:00:00"}]
[null,null,"Helyezés",{"$f":"IF(ISBLANK(D43),\"\",E128)","v":""},null,null,{"$f":"IF(ISBLANK(G43),\"\",H128)","v":""},null,null,{"$f":"IF(ISBLANK(J43),\"\",K128)","v":""},null,null,{"$f":"IF(ISBLANK(M43),\"\",N128)","v":""},null,null,{"$f":"IF(ISBLANK(P43),\"\",Q128)","v":""},null,null,{"$f":"IF(ISBLANK(S43),\"\",T128)","v":""},null,null,{"$f":"IF(ISBLANK(V43),\"\",W128)","v":""},null,null,{"$f":"IF(ISBLANK(Y43),\"\",Z128)","v":""},null,null,{"$f":"IF(ISBLANK(AB43),\"\",AC128)","v":""},null,null,{"$f":"IF(ISBLANK(AE43),\"\",AF128)","v":""},null,null,null,{"$f":"IF(ISBLANK(AI43),0,AJ128)","v":"00:00:00"}]
[null,null,"Pont/Összp.",{"$f":"IF(ISBLANK(D43),\"\",$C$87-E111+1)","v":""},{"$f":"D47","v":""},null,{"$f":"IF(ISBLANK(G43),\"\",$C$87-H111+1)","v":""},{"$f":"IF(ISBLANK(G43),\"\",SUM(E47,G47))","v":""},null,{"$f":"IF(ISBLANK(J43),\"\",$C$87-K111+1)","v":""},{"$f":"IF(ISBLANK(J43),\"\",SUM(H47,J47))","v":""},null,{"$f":"IF(ISBLANK(M43),\"\",$C$87-N111+1)","v":""},{"$f":"IF(ISBLANK(M43),\"\",SUM(K47,M47))","v":""},null,{"$f":"IF(ISBLANK(P43),\"\",$C$87-Q111+1)","v":""},{"$f":"IF(ISBLANK(P43),\"\",SUM(N47,P47))","v":""},null,{"$f":"IF(ISBLANK(S43),\"\",$C$87-T111+1)","v":""},{"$f":"IF(ISBLANK(S43),\"\",SUM(Q47,S47))","v":""},null,{"$f":"IF(ISBLANK(V43),\"\",$C$87-W111+1)","v":""},{"$f":"IF(ISBLANK(V43),\"\",SUM(T47,V47))","v":""},null,{"$f":"IF(ISBLANK(Y43),\"\",$C$87-Z111+1)","v":""},{"$f":"IF(ISBLANK(Y43),\"\",SUM(W47,Y47))","v":""},null,{"$f":"IF(ISBLANK(AB43),\"\",$C$87-AC111+1)","v":""},{"$f":"IF(ISBLANK(AB43),\"\",SUM(Z47,AB47))","v":""},null,{"$f":"IF(ISBLANK(AE43),\"\",$C$87-AF111+1)","v":""},{"$f":"IF(ISBLANK(AE43),\"\",SUM(AC47,AE47))","v":""}]
["10.",null,"Idő (p:mp:tmp):",null,null,{"$f":"IF(ISBLANK(D48),\"\",RANK(E52,(E$7,E$12,E$17,E$22,E$27,E$32,E$37,E$42,E$47,E$52,E$57,E$62),0))","v":""},null,null,{"$f":"IF(ISBLANK(G48),\"\",RANK(H52,(H$7,H$12,H$17,H$22,H$27,H$32,H$37,H$42,H$47,H$52,H$57,H$62),0))","v":""},null,null,{"$f":"IF(ISBLANK(J48),\"\",RANK(K52,(K$7,K$12,K$17,K$22,K$27,K$32,K$37,K$42,K$47,K$52,K$57,K$62),0))","v":""},null,null,{"$f":"IF(ISBLANK(M48),\"\",RANK(N52,(N$7,N$12,N$17,N$22,N$27,N$32,N$37,N$42,N$47,N$52,N$57,N$62),0))","v":""},null,null,{"$f":"IF(ISBLANK(P48),\"\",RANK(Q52,(Q$7,Q$12,Q$17,Q$22,Q$27,Q$32,Q$37,Q$42,Q$47,Q$52,Q$57,Q$62),0))","v":""},null,null,{"$f":"IF(ISBLANK(S48),\"\",RANK(T52,(T$7,T$12,T$17,T$22,T$27,T$32,T$37,T$42,T$47,T$52,T$57,T$62),0))","v":""},null,null,{"$f":"IF(ISBLANK(V48),\"\",RANK(W52,(W$7,W$12,W$17,W$22,W$27,W$32,W$37,W$42,W$47,W$52,W$57,W$62),0))","v":""},null,null,{"$f":"IF(ISBLANK(Y48),\"\",RANK(Z52,(Z$7,Z$12,Z$17,Z$22,Z$27,Z$32,Z$37,Z$42,Z$47,Z$52,Z$57,Z$62),0))","v":""},null,null,{"$f":"IF(ISBLANK(AB48),\"\",RANK(AC52,(AC$7,AC$12,AC$17,AC$22,AC$27,AC$32,AC$37,AC$42,AC$47,AC$52,AC$57,AC$62),0))","v":""},null,null,{"$f":"IF(ISBLANK(D48),\"\",SUM(D52,G52,J52,M52,P52,S52,V52,Y52,AB52,AE52,AE49)+IF(AI51=0,0,(($C$87-AI51+1)/1000)))","v":""},{"$f":"IF(ISBLANK(D48),\"\",RANK(AG48,($AG$3,$AG$8,$AG$13,$AG$18,$AG$23,$AG$28,$AG$33,$AG$38,$AG$43,$AG$48,$AG$53,$AG$58)))","v":""}]
[null,null,"Hiba (p:mp:tmp):"]
[null,null,"Össz.idő",{"$f":"SUM(D48,D49)","v":"00:00:00"},null,null,{"$f":"SUM(G48,G49)","v":"00:00:00"},null,null,{"$f":"SUM(J48,J49)","v":"00:00:00"},null,null,{"$f":"SUM(M48,M49)","v":"00:00:00"},null,null,{"$f":"SUM(P48,P49)","v":0},null,null,{"$f":"SUM(S48,S49)","v":"00:00:00"},null,null,{"$f":"SUM(V48,V49)","v":"00:00:00"},null,null,{"$f":"SUM(Y48,Y49)","v":"00:00:00"},null,null,{"$f":"SUM(AB48,AB49)","v":"00:00:00"},null,null,{"$f":"AE48","v":0},null,null,null,{"$f":"SUM(AI48:AJ49)","v":"00:00:00"}]
[null,null,"Helyezés",{"$f":"IF(ISBLANK(D48),\"\",E129)","v":""},null,null,{"$f":"IF(ISBLANK(G48),\"\",H129)","v":""},null,null,{"$f":"IF(ISBLANK(J48),\"\",K129)","v":""},null,null,{"$f":"IF(ISBLANK(M48),\"\",N129)","v":""},null,null,{"$f":"IF(ISBLANK(P48),\"\",Q129)","v":""},null,null,{"$f":"IF(ISBLANK(S48),\"\",T129)","v":""},null,null,{"$f":"IF(ISBLANK(V48),\"\",W129)","v":""},null,null,{"$f":"IF(ISBLANK(Y48),\"\",Z129)","v":""},null,null,{"$f":"IF(ISBLANK(AB48),\"\",AC129)","v":""},null,null,{"$f":"IF(ISBLANK(AE48),\"\",AF129)","v":""},null,null,null,{"$f":"IF(ISBLANK(AI48),0,AJ129)","v":"00:00:00"}]
[null,null,"Pont/Összp.",{"$f":"IF(ISBLANK(D48),\"\",$C$87-E112+1)","v":""},{"$f":"D52","v":""},null,{"$f":"IF(ISBLANK(G48),\"\",$C$87-H112+1)","v":""},{"$f":"IF(ISBLANK(G48),\"\",SUM(E52,G52))","v":""},null,{"$f":"IF(ISBLANK(J48),\"\",$C$87-K112+1)","v":""},{"$f":"IF(ISBLANK(J48),\"\",SUM(H52,J52))","v":""},null,{"$f":"IF(ISBLANK(M48),\"\",$C$87-N112+1)","v":""},{"$f":"IF(ISBLANK(M48),\"\",SUM(K52,M52))","v":""},null,{"$f":"IF(ISBLANK(P48),\"\",$C$87-Q112+1)","v":""},{"$f":"IF(ISBLANK(P48),\"\",SUM(N52,P52))","v":""},null,{"$f":"IF(ISBLANK(S48),\"\",$C$87-T112+1)","v":""},{"$f":"IF(ISBLANK(S48),\"\",SUM(Q52,S52))","v":""},null,{"$f":"IF(ISBLANK(V48),\"\",$C$87-W112+1)","v":""},{"$f":"IF(ISBLANK(V48),\"\",SUM(T52,V52))","v":""},null,{"$f":"IF(ISBLANK(Y48),\"\",$C$87-Z112+1)","v":""},{"$f":"IF(ISBLANK(Y48),\"\",SUM(W52,Y52))","v":""},null,{"$f":"IF(ISBLANK(AB48),\"\",$C$87-AC112+1)","v":""},{"$f":"IF(ISBLANK(AB48),\"\",SUM(Z52,AB52))","v":""},null,{"$f":"IF(ISBLANK(AE48),\"\",$C$87-AF112+1)","v":""},{"$f":"IF(ISBLANK(AE48),\"\",SUM(AC52,AE52))","v":""}]
["11.",null,"Idő (p:mp:tmp):",null,null,{"$f":"IF(ISBLANK(D53),\"\",RANK(E57,(E$7,E$12,E$17,E$22,E$27,E$32,E$37,E$42,E$47,E$52,E$57,E$62),0))","v":""},null,null,{"$f":"IF(ISBLANK(G53),\"\",RANK(H57,(H$7,H$12,H$17,H$22,H$27,H$32,H$37,H$42,H$47,H$52,H$57,H$62),0))","v":""},null,null,{"$f":"IF(ISBLANK(J53),\"\",RANK(K57,(K$7,K$12,K$17,K$22,K$27,K$32,K$37,K$42,K$47,K$52,K$57,K$62),0))","v":""},null,null,{"$f":"IF(ISBLANK(M53),\"\",RANK(N57,(N$7,N$12,N$17,N$22,N$27,N$32,N$37,N$42,N$47,N$52,N$57,N$62),0))","v":""},null,null,{"$f":"IF(ISBLANK(P53),\"\",RANK(Q57,(Q$7,Q$12,Q$17,Q$22,Q$27,Q$32,Q$37,Q$42,Q$47,Q$52,Q$57,Q$62),0))","v":""},null,null,{"$f":"IF(ISBLANK(S53),\"\",RANK(T57,(T$7,T$12,T$17,T$22,T$27,T$32,T$37,T$42,T$47,T$52,T$57,T$62),0))","v":""},null,null,{"$f":"IF(ISBLANK(V53),\"\",RANK(W57,(W$7,W$12,W$17,W$22,W$27,W$32,W$37,W$42,W$47,W$52,W$57,W$62),0))","v":""},null,null,{"$f":"IF(ISBLANK(Y53),\"\",RANK(Z57,(Z$7,Z$12,Z$17,Z$22,Z$27,Z$32,Z$37,Z$42,Z$47,Z$52,Z$57,Z$62),0))","v":""},null,null,{"$f":"IF(ISBLANK(AB53),\"\",RANK(AC57,(AC$7,AC$12,AC$17,AC$22,AC$27,AC$32,AC$37,AC$42,AC$47,AC$52,AC$57,AC$62),0))","v":""},null,null,{"$f":"IF(ISBLANK(D53),\"\",SUM(D57,G57,J57,M57,P57,S57,V57,Y57,AB57,AE57,AE54)+IF(AI56=0,0,(($C$87-AI56+1)/1000)))","v":""},{"$f":"IF(ISBLANK(D53),\"\",RANK(AG53,($AG$3,$AG$8,$AG$13,$AG$18,$AG$23,$AG$28,$AG$33,$AG$38,$AG$43,$AG$48,$AG$53,$AG$58)))","v":""}]
[null,null,"Hiba (p:mp:tmp):"]
[null,null,"Össz.idő",{"$f":"SUM(D53,D54)","v":"00:00:00"},null,null,{"$f":"SUM(G53,G54)","v":"00:00:00"},null,null,{"$f":"SUM(J53,J54)","v":"00:00:00"},null,null,{"$f":"SUM(M53,M54)","v":"00:00:00"},null,null,{"$f":"SUM(P53,P54)","v":0},null,null,{"$f":"SUM(S53,S54)","v":"00:00:00"},null,null,{"$f":"SUM(V53,V54)","v":"00:00:00"},null,null,{"$f":"SUM(Y53,Y54)","v":"00:00:00"},null,null,{"$f":"SUM(AB53,AB54)","v":"00:00:00"},null,null,{"$f":"AE53","v":0},null,null,null,{"$f":"SUM(AI53:AJ54)","v":"00:00:00"}]
[null,null,"Helyezés",{"$f":"IF(ISBLANK(D53),\"\",E130)","v":""},null,null,{"$f":"IF(ISBLANK(G53),\"\",H130)","v":""},null,null,{"$f":"IF(ISBLANK(J53),\"\",K130)","v":""},null,null,{"$f":"IF(ISBLANK(M53),\"\",N130)","v":""},null,null,{"$f":"IF(ISBLANK(P53),\"\",Q130)","v":""},null,null,{"$f":"IF(ISBLANK(S53),\"\",T130)","v":""},null,null,{"$f":"IF(ISBLANK(V53),\"\",W130)","v":""},null,null,{"$f":"IF(ISBLANK(Y53),\"\",Z130)","v":""},null,null,{"$f":"IF(ISBLANK(AB53),\"\",AC130)","v":""},null,null,{"$f":"IF(ISBLANK(AE53),\"\",AF130)","v":""},null,null,null,{"$f":"IF(ISBLANK(AI53),0,AJ130)","v":"00:00:00"}]
[null,null,"Pont/Összp.",{"$f":"IF(ISBLANK(D53),\"\",$C$87-E113+1)","v":""},{"$f":"D57","v":""},null,{"$f":"IF(ISBLANK(G53),\"\",$C$87-H113+1)","v":""},{"$f":"IF(ISBLANK(G53),\"\",SUM(E57,G57))","v":""},null,{"$f":"IF(ISBLANK(J53),\"\",$C$87-K113+1)","v":""},{"$f":"IF(ISBLANK(J53),\"\",SUM(H57,J57))","v":""},null,{"$f":"IF(ISBLANK(M53),\"\",$C$87-N113+1)","v":""},{"$f":"IF(ISBLANK(M53),\"\",SUM(K57,M57))","v":""},null,{"$f":"IF(ISBLANK(P53),\"\",$C$87-Q113+1)","v":""},{"$f":"IF(ISBLANK(P53),\"\",SUM(N57,P57))","v":""},null,{"$f":"IF(ISBLANK(S53),\"\",$C$87-T113+1)","v":""},{"$f":"IF(ISBLANK(S53),\"\",SUM(Q57,S57))","v":""},null,{"$f":"IF(ISBLANK(V53),\"\",$C$87-W113+1)","v":""},{"$f":"IF(ISBLANK(V53),\"\",SUM(T57,V57))","v":""},null,{"$f":"IF(ISBLANK(Y53),\"\",$C$87-Z113+1)","v":""},{"$f":"IF(ISBLANK(Y53),\"\",SUM(W57,Y57))","v":""},null,{"$f":"IF(ISBLANK(AB53),\"\",$C$87-AC113+1)","v":""},{"$f":"IF(ISBLANK(AB53),\"\",SUM(Z57,AB57))","v":""},null,{"$f":"IF(ISBLANK(AE53),\"\",$C$87-AF113+1)","v":""},{"$f":"IF(ISBLANK(AE53),\"\",SUM(AC57,AE57))","v":""}]
["12.",null,"Idő (p:mp:tmp):",null,null,{"$f":"IF(ISBLANK(D58),\"\",RANK(E62,(E$7,E$12,E$17,E$22,E$27,E$32,E$37,E$42,E$47,E$52,E$57,E$62),0))","v":""},null,null,{"$f":"IF(ISBLANK(G58),\"\",RANK(H62,(H$7,H$12,H$17,H$22,H$27,H$32,H$37,H$42,H$47,H$52,H$57,H$62),0))","v":""},null,null,{"$f":"IF(ISBLANK(J58),\"\",RANK(K62,(K$7,K$12,K$17,K$22,K$27,K$32,K$37,K$42,K$47,K$52,K$57,K$62),0))","v":""},null,null,{"$f":"IF(ISBLANK(M58),\"\",RANK(N62,(N$7,N$12,N$17,N$22,N$27,N$32,N$37,N$42,N$47,N$52,N$57,N$62),0))","v":""},null,null,{"$f":"IF(ISBLANK(P58),\"\",RANK(Q62,(Q$7,Q$12,Q$17,Q$22,Q$27,Q$32,Q$37,Q$42,Q$47,Q$52,Q$57,Q$62),0))","v":""},null,null,{"$f":"IF(ISBLANK(S58),\"\",RANK(T62,(T$7,T$12,T$17,T$22,T$27,T$32,T$37,T$42,T$47,T$52,T$57,T$62),0))","v":""},null,null,{"$f":"IF(ISBLANK(V58),\"\",RANK(W62,(W$7,W$12,W$17,W$22,W$27,W$32,W$37,W$42,W$47,W$52,W$57,W$62),0))","v":""},null,null,{"$f":"IF(ISBLANK(Y58),\"\",RANK(Z62,(Z$7,Z$12,Z$17,Z$22,Z$27,Z$32,Z$37,Z$42,Z$47,Z$52,Z$57,Z$62),0))","v":""},null,null,{"$f":"IF(ISBLANK(AB58),\"\",RANK(AC62,(AC$7,AC$12,AC$17,AC$22,AC$27,AC$32,AC$37,AC$42,AC$47,AC$52,AC$57,AC$62),0))","v":""},null,null,{"$f":"IF(ISBLANK(D58),\"\",SUM(D62,G62,J62,M62,P62,S62,V62,Y62,AB62,AE62,AE59)+IF(AI61=0,0,(($C$87-AI61+1)/1000)))","v":""},{"$f":"IF(ISBLANK(D58),\"\",RANK(AG58,($AG$3,$AG$8,$AG$13,$AG$18,$AG$23,$AG$28,$AG$33,$AG$38,$AG$43,$AG$48,$AG$53,$AG$58)))","v":""}]
[null,null,"Hiba (p:mp:tmp):"]
[null,null,"Össz.idő",{"$f":"SUM(D58,D59)","v":"00:00:00"},null,null,{"$f":"SUM(G58,G59)","v":"00:00:00"},null,null,{"$f":"SUM(J58,J59)","v":"00:00:00"},null,null,{"$f":"SUM(M58,M59)","v":"00:00:00"},null,null,{"$f":"SUM(P58,P59)","v":0},null,null,{"$f":"SUM(S58,S59)","v":"00:00:00"},null,null,{"$f":"SUM(V58,V59)","v":"00:00:00"},null,null,{"$f":"SUM(Y58,Y59)","v":"00:00:00"},null,null,{"$f":"SUM(AB58,AB59)","v":"00:00:00"},null,null,{"$f":"AE58","v":0},null,null,null,{"$f":"SUM(AI58:AJ59)","v":"00:00:00"}]
[null,null,"Helyezés",{"$f":"IF(ISBLANK(D58),\"\",E131)","v":""},null,null,{"$f":"IF(ISBLANK(G58),\"\",H131)","v":""},null,null,{"$f":"IF(ISBLANK(J58),\"\",K131)","v":""},null,null,{"$f":"IF(ISBLANK(M58),\"\",N131)","v":""},null,null,{"$f":"IF(ISBLANK(P58),\"\",Q131)","v":""},null,null,{"$f":"IF(ISBLANK(S58),\"\",T131)","v":""},null,null,{"$f":"IF(ISBLANK(V58),\"\",W131)","v":""},null,null,{"$f":"IF(ISBLANK(Y58),\"\",Z131)","v":""},null,null,{"$f":"IF(ISBLANK(AB58),\"\",AC131)","v":""},null,null,{"$f":"IF(ISBLANK(AE58),\"\",AF131)","v":""},null,null,null,{"$f":"IF(ISBLANK(AI58),0,AJ131)","v":"00:00:00"}]
[null,null,"Pont/Összp.",{"$f":"IF(ISBLANK(D58),\"\",$C$87-E114+1)","v":""},{"$f":"D62","v":""},null,{"$f":"IF(ISBLANK(G58),\"\",$C$87-H114+1)","v":""},{"$f":"IF(ISBLANK(G58),\"\",SUM(E62,G62))","v":""},null,{"$f":"IF(ISBLANK(J58),\"\",$C$87-K114+1)","v":""},{"$f":"IF(ISBLANK(J58),\"\",SUM(H62,J62))","v":""},null,{"$f":"IF(ISBLANK(M58),\"\",$C$87-N114+1)","v":""},{"$f":"IF(ISBLANK(M58),\"\",SUM(K62,M62))","v":""},null,{"$f":"IF(ISBLANK(P58),\"\",$C$87-Q114+1)","v":""},{"$f":"IF(ISBLANK(P58),\"\",SUM(N62,P62))","v":""},null,{"$f":"IF(ISBLANK(S58),\"\",$C$87-T114+1)","v":""},{"$f":"IF(ISBLANK(S58),\"\",SUM(Q62,S62))","v":""},null,{"$f":"IF(ISBLANK(V58),\"\",$C$87-W114+1)","v":""},{"$f":"IF(ISBLANK(V58),\"\",SUM(T62,V62))","v":""},null,{"$f":"IF(ISBLANK(Y58),\"\",$C$87-Z114+1)","v":""},{"$f":"IF(ISBLANK(Y58),\"\",SUM(W62,Y62))","v":""},null,{"$f":"IF(ISBLANK(AB58),\"\",$C$87-AC114+1)","v":""},{"$f":"IF(ISBLANK(AB58),\"\",SUM(Z62,AB62))","v":""},null,{"$f":"IF(ISBLANK(AE58),\"\",$C$87-AF114+1)","v":""},{"$f":"IF(ISBLANK(AE58),\"\",SUM(AC62,AE62))","v":""}]
[]
[]
[]
[]
[]
[]
[]
[]
[]
[]
[]
[]
[]
[]
[]
[]
[]
[]
[]
[]
[]
[]
[]
[]
[null,"csapatok száma",{"$f":"COUNTA(B3:B62)","v":5},{"$f":"IF(E1=\"idő\",1,0)","v":1},null,null,{"$f":"IF(H1=\"idő\",1,0)","v":1},null,null,{"$f":"IF(K1=\"idő\",1,0)","v":1},null,null,{"$f":"IF(N1=\"idő\",1,0)","v":1},null,null,{"$f":"IF(Q1=\"idő\",1,0)","v":1},null,null,{"$f":"IF(T1=\"idő\",1,0)","v":1},null,null,{"$f":"IF(W1=\"idő\",1,0)","v":1},null,null,{"$f":"IF(Z1=\"idő\",1,0)","v":1},null,null,{"$f":"IF(AC1=\"idő\",1,0)","v":1},null,null,{"$f":"IF(OR(AF1=\"idő\",AF1=\"helyezés\"),1,0)","v":1},null,null,null,{"$f":"IF(OR(AJ1=\"idő\",AJ1=\"helyezés\"),1,0)","v":1}]
[null,1,0]
[null,2,1,{"$f":"D6","v":3},{"$f":"IF(COUNTIF(D$89:D$99,D89)=1,D89,(COUNTIF(D$89:D$99,D89)*D89+VLOOKUP(COUNTIF(D$89:D$99,D89),$B$89:$C$99,2))/COUNTIF(D$89:D$99,D89))","v":3},null,{"$f":"G6","v":5},{"$f":"IF(COUNTIF(G$89:G$99,G89)=1,G89,(COUNTIF(G$89:G$99,G89)*G89+VLOOKUP(COUNTIF(G$89:G$99,G89),$B$89:$C$99,2))/COUNTIF(G$89:G$99,G89))","v":5},null,{"$f":"J6","v":5},{"$f":"IF(COUNTIF(J$89:J$99,J89)=1,J89,(COUNTIF(J$89:J$99,J89)*J89+VLOOKUP(COUNTIF(J$89:J$99,J89),$B$89:$C$99,2))/COUNTIF(J$89:J$99,J89))","v":5},null,{"$f":"M6","v":4},{"$f":"IF(COUNTIF(M$89:M$99,M89)=1,M89,(COUNTIF(M$89:M$99,M89)*M89+VLOOKUP(COUNTIF(M$89:M$99,M89),$B$89:$C$99,2))/COUNTIF(M$89:M$99,M89))","v":4},null,{"$f":"P6","v":4},{"$f":"IF(COUNTIF(P$89:P$99,P89)=1,P89,(COUNTIF(P$89:P$99,P89)*P89+VLOOKUP(COUNTIF(P$89:P$99,P89),$B$89:$C$99,2))/COUNTIF(P$89:P$99,P89))","v":4},null,{"$f":"S6","v":5},{"$f":"IF(COUNTIF(S$89:S$99,S89)=1,S89,(COUNTIF(S$89:S$99,S89)*S89+VLOOKUP(COUNTIF(S$89:S$99,S89),$B$89:$C$99,2))/COUNTIF(S$89:S$99,S89))","v":5},null,{"$f":"V6","v":4},{"$f":"IF(COUNTIF(V$89:V$99,V89)=1,V89,(COUNTIF(V$89:V$99,V89)*V89+VLOOKUP(COUNTIF(V$89:V$99,V89),$B$89:$C$99,2))/COUNTIF(V$89:V$99,V89))","v":4},null,{"$f":"Y6","v":5},{"$f":"IF(COUNTIF(Y$89:Y$99,Y89)=1,Y89,(COUNTIF(Y$89:Y$99,Y89)*Y89+VLOOKUP(COUNTIF(Y$89:Y$99,Y89),$B$89:$C$99,2))/COUNTIF(Y$89:Y$99,Y89))","v":5},null,{"$f":"AB6","v":5},{"$f":"IF(COUNTIF(AB$89:AB$99,AB89)=1,AB89,(COUNTIF(AB$89:AB$99,AB89)*AB89+VLOOKUP(COUNTIF(AB$89:AB$99,AB89),$B$89:$C$99,2))/COUNTIF(AB$89:AB$99,AB89))","v":5},null,{"$f":"AE6","v":2},{"$f":"IF(COUNTIF(AE$89:AE$99,AE89)=1,AE89,(COUNTIF(AE$89:AE$99,AE89)*AE89+VLOOKUP(COUNTIF(AE$89:AE$99,AE89),$B$89:$C$99,2))/COUNTIF(AE$89:AE$99,AE89))","v":2},null,null,{"$f":"AI6","v":0},{"$f":"IF(COUNTIF(AI$89:AI$99,AI89)=1,AI89,(COUNTIF(AI$89:AI$99,AI89)*AI89+VLOOKUP(COUNTIF(AI$89:AI$99,AI89),$B$89:$C$99,2))/COUNTIF(AI$89:AI$99,AI89))","v":5}]
[null,3,3,{"$f":"D11","v":5},{"$f":"IF(COUNTIF(D$89:D$99,D90)=1,D90,(COUNTIF(D$89:D$99,D90)*D90+VLOOKUP(COUNTIF(D$89:D$99,D90),$B$89:$C$99,2))/COUNTIF(D$89:D$99,D90))","v":5},null,{"$f":"G11","v":4},{"$f":"IF(COUNTIF(G$89:G$99,G90)=1,G90,(COUNTIF(G$89:G$99,G90)*G90+VLOOKUP(COUNTIF(G$89:G$99,G90),$B$89:$C$99,2))/COUNTIF(G$89:G$99,G90))","v":4},null,{"$f":"J11","v":4},{"$f":"IF(COUNTIF(J$89:J$99,J90)=1,J90,(COUNTIF(J$89:J$99,J90)*J90+VLOOKUP(COUNTIF(J$89:J$99,J90),$B$89:$C$99,2))/COUNTIF(J$89:J$99,J90))","v":4},null,{"$f":"M11","v":5},{"$f":"IF(COUNTIF(M$89:M$99,M90)=1,M90,(COUNTIF(M$89:M$99,M90)*M90+VLOOKUP(COUNTIF(M$89:M$99,M90),$B$89:$C$99,2))/COUNTIF(M$89:M$99,M90))","v":5},null,{"$f":"P11","v":1},{"$f":"IF(COUNTIF(P$89:P$99,P90)=1,P90,(COUNTIF(P$89:P$99,P90)*P90+VLOOKUP(COUNTIF(P$89:P$99,P90),$B$89:$C$99,2))/COUNTIF(P$89:P$99,P90))","v":1},null,{"$f":"S11","v":4},{"$f":"IF(COUNTIF(S$89:S$99,S90)=1,S90,(COUNTIF(S$89:S$99,S90)*S90+VLOOKUP(COUNTIF(S$89:S$99,S90),$B$89:$C$99,2))/COUNTIF(S$89:S$99,S90))","v":4},null,{"$f":"V11","v":2},{"$f":"IF(COUNTIF(V$89:V$99,V90)=1,V90,(COUNTIF(V$89:V$99,V90)*V90+VLOOKUP(COUNTIF(V$89:V$99,V90),$B$89:$C$99,2))/COUNTIF(V$89:V$99,V90))","v":2},null,{"$f":"Y11","v":3},{"$f":"IF(COUNTIF(Y$89:Y$99,Y90)=1,Y90,(COUNTIF(Y$89:Y$99,Y90)*Y90+VLOOKUP(COUNTIF(Y$89:Y$99,Y90),$B$89:$C$99,2))/COUNTIF(Y$89:Y$99,Y90))","v":3},null,{"$f":"AB11","v":4},{"$f":"IF(COUNTIF(AB$89:AB$99,AB90)=1,AB90,(COUNTIF(AB$89:AB$99,AB90)*AB90+VLOOKUP(COUNTIF(AB$89:AB$99,AB90),$B$89:$C$99,2))/COUNTIF(AB$89:AB$99,AB90))","v":4},null,{"$f":"AE11","v":1},{"$f":"IF(COUNTIF(AE$89:AE$99,AE90)=1,AE90,(COUNTIF(AE$89:AE$99,AE90)*AE90+VLOOKUP(COUNTIF(AE$89:AE$99,AE90),$B$89:$C$99,2))/COUNTIF(AE$89:AE$99,AE90))","v":1},null,null,{"$f":"AI11","v":0},{"$f":"IF(COUNTIF(AI$89:AI$99,AI90)=1,AI90,(COUNTIF(AI$89:AI$99,AI90)*AI90+VLOOKUP(COUNTIF(AI$89:AI$99,AI90),$B$89:$C$99,2))/COUNTIF(AI$89:AI$99,AI90))","v":5}]
[null,4,6,{"$f":"D16","v":4},4,null,{"$f":"G16","v":1},1,null,{"$f":"J16","v":3},3,null,{"$f":"M16","v":1},1,null,{"$f":"P16","v":5},5,null,{"$f":"S16","v":3},3,null,{"$f":"V16","v":5},5,null,{"$f":"Y16","v":4},4,null,{"$f":"AB16","v":3},3,null,{"$f":"AE16","v":5},5,null,null,{"$f":"AI16","v":0},5]
[null,5,10,{"$f":"D21","v":1},1,null,{"$f":"G21","v":3},3,null,{"$f":"J21","v":2},2,null,{"$f":"M21","v":3},3,null,{"$f":"P21","v":2},2,null,{"$f":"S21","v":2},2,null,{"$f":"V21","v":1},1,null,{"$f":"Y21","v":2},2,null,{"$f":"AB21","v":2},2,null,{"$f":"AE21","v":4},4,null,null,{"$f":"AI21","v":0},5]
[null,6,15,{"$f":"D26","v":2},2,null,{"$f":"G26","v":2},2,null,{"$f":"J26","v":1},1,null,{"$f":"M26","v":2},2,null,{"$f":"P26","v":3},3,null,{"$f":"S26","v":1},1,null,{"$f":"V26","v":3},3,null,{"$f":"Y26","v":1},1,null,{"$f":"AB26","v":1},1,null,{"$f":"AE26","v":3},3,null,null,{"$f":"AI26","v":0},5]
[null,7,21,{"$f":"D31","v":""},{"$error":"#VALUE!"},null,{"$f":"G31","v":""},{"$error":"#VALUE!"},null,{"$f":"J31","v":""},{"$error":"#VALUE!"},null,{"$f":"M31","v":""},{"$error":"#VALUE!"},null,{"$f":"P31","v":""},{"$error":"#VALUE!"},null,{"$f":"S31","v":""},{"$error":"#VALUE!"},null,{"$f":"V31","v":""},{"$error":"#VALUE!"},null,{"$f":"Y31","v":""},{"$error":"#VALUE!"},null,{"$f":"AB31","v":""},{"$error":"#VALUE!"},null,{"$f":"AE31","v":""},{"$error":"#VALUE!"},null,null,{"$f":"AI31","v":0},5]
[null,8,28,{"$f":"D36","v":""},{"$error":"#VALUE!"},null,{"$f":"G36","v":""},{"$error":"#VALUE!"},null,{"$f":"J36","v":""},{"$error":"#VALUE!"},null,{"$f":"M36","v":""},{"$error":"#VALUE!"},null,{"$f":"P36","v":""},{"$error":"#VALUE!"},null,{"$f":"S36","v":""},{"$error":"#VALUE!"},null,{"$f":"V36","v":""},{"$error":"#VALUE!"},null,{"$f":"Y36","v":""},{"$error":"#VALUE!"},null,{"$f":"AB36","v":""},{"$error":"#VALUE!"},null,{"$f":"AE36","v":""},{"$error":"#VALUE!"},null,null,{"$f":"AI36","v":0},5]
[null,9,36,{"$f":"D41","v":""},{"$error":"#VALUE!"},null,{"$f":"G41","v":""},{"$error":"#VALUE!"},null,{"$f":"J41","v":""},{"$error":"#VALUE!"},null,{"$f":"M41","v":""},{"$error":"#VALUE!"},null,{"$f":"P41","v":""},{"$error":"#VALUE!"},null,{"$f":"S41","v":""},{"$error":"#VALUE!"},null,{"$f":"V41","v":""},{"$error":"#VALUE!"},null,{"$f":"Y41","v":""},{"$error":"#VALUE!"},null,{"$f":"AB41","v":""},{"$error":"#VALUE!"},null,{"$f":"AE41","v":""},{"$error":"#VALUE!"},null,null,{"$f":"AI41","v":0},5]
[null,10,45,{"$f":"D46","v":""},{"$error":"#VALUE!"},null,{"$f":"G46","v":""},{"$error":"#VALUE!"},null,{"$f":"J46","v":""},{"$error":"#VALUE!"},null,{"$f":"M46","v":""},{"$error":"#VALUE!"},null,{"$f":"P46","v":""},{"$error":"#VALUE!"},null,{"$f":"S46","v":""},{"$error":"#VALUE!"},null,{"$f":"V46","v":""},{"$error":"#VALUE!"},null,{"$f":"Y46","v":""},{"$error":"#VALUE!"},null,{"$f":"AB46","v":""},{"$error":"#VALUE!"},null,{"$f":"AE46","v":""},{"$error":"#VALUE!"},null,null,{"$f":"AI46","v":0},5]
[null,11,55,{"$f":"D51","v":""},{"$error":"#VALUE!"},null,{"$f":"G51","v":""},{"$error":"#VALUE!"},null,{"$f":"J51","v":""},{"$error":"#VALUE!"},null,{"$f":"M51","v":""},{"$error":"#VALUE!"},null,{"$f":"P51","v":""},{"$error":"#VALUE!"},null,{"$f":"S51","v":""},{"$error":"#VALUE!"},null,{"$f":"V51","v":""},{"$error":"#VALUE!"},null,{"$f":"Y51","v":""},{"$error":"#VALUE!"},null,{"$f":"AB51","v":""},{"$error":"#VALUE!"},null,{"$f":"AE51","v":""},{"$error":"#VALUE!"},null,null,{"$f":"AI51","v":0},5]
[null,12,66,{"$f":"D56","v":""},{"$error":"#VALUE!"},null,{"$f":"G56","v":""},{"$error":"#VALUE!"},null,{"$f":"J56","v":""},{"$error":"#VALUE!"},null,{"$f":"M56","v":""},{"$error":"#VALUE!"},null,{"$f":"P56","v":""},{"$error":"#VALUE!"},null,{"$f":"S56","v":""},{"$error":"#VALUE!"},null,{"$f":"V56","v":""},{"$error":"#VALUE!"},null,{"$f":"Y56","v":""},{"$error":"#VALUE!"},null,{"$f":"AB56","v":""},{"$error":"#VALUE!"},null,{"$f":"AE56","v":""},{"$error":"#VALUE!"},null,null,{"$f":"AI56","v":0},5]
[null,null,78,{"$f":"D51","v":""},{"$error":"#VALUE!"},null,{"$f":"G51","v":""},{"$error":"#VALUE!"},null,{"$f":"J51","v":""},{"$error":"#VALUE!"},null,{"$f":"M51","v":""},{"$error":"#VALUE!"},null,{"$f":"P51","v":""},{"$error":"#VALUE!"},null,{"$f":"S51","v":""},{"$error":"#VALUE!"},null,{"$f":"V51","v":""},{"$error":"#VALUE!"},null,{"$f":"Y51","v":""},{"$error":"#VALUE!"},null,{"$f":"AB51","v":""},{"$error":"#VALUE!"},null,{"$f":"AE51","v":""},{"$error":"#VALUE!"},null,null,{"$f":"AI51","v":0},5]
[]
[]
[null,1,"pontszám",{"$f":"D6","v":3},{"$f":"IF(COUNTIF(D$103:D$114,D103)=1,D103,(COUNTIF(D$103:D$114,D103)*D103+VLOOKUP(COUNTIF(D$103:D$114,D103),$B$88:$C$99,2))/COUNTIF(D$103:D$114,D103))","v":3},null,{"$f":"G6","v":5},{"$f":"IF(COUNTIF(G$103:G$114,G103)=1,G103,(COUNTIF(G$103:G$114,G103)*G103+VLOOKUP(COUNTIF(G$103:G$114,G103),$B$88:$C$99,2))/COUNTIF(G$103:G$114,G103))","v":5},null,{"$f":"J6","v":5},{"$f":"IF(COUNTIF(J$103:J$114,J103)=1,J103,(COUNTIF(J$103:J$114,J103)*J103+VLOOKUP(COUNTIF(J$103:J$114,J103),$B$88:$C$99,2))/COUNTIF(J$103:J$114,J103))","v":5},null,{"$f":"M6","v":4},{"$f":"IF(COUNTIF(M$103:M$114,M103)=1,M103,(COUNTIF(M$103:M$114,M103)*M103+VLOOKUP(COUNTIF(M$103:M$114,M103),$B$88:$C$99,2))/COUNTIF(M$103:M$114,M103))","v":4},null,{"$f":"P6","v":4},{"$f":"IF(COUNTIF(P$103:P$114,P103)=1,P103,(COUNTIF(P$103:P$114,P103)*P103+VLOOKUP(COUNTIF(P$103:P$114,P103),$B$88:$C$99,2))/COUNTIF(P$103:P$114,P103))","v":4},null,{"$f":"S6","v":5},{"$f":"IF(COUNTIF(S$103:S$114,S103)=1,S103,(COUNTIF(S$103:S$114,S103)*S103+VLOOKUP(COUNTIF(S$103:S$114,S103),$B$88:$C$99,2))/COUNTIF(S$103:S$114,S103))","v":5},null,{"$f":"V6","v":4},{"$f":"IF(COUNTIF(V$103:V$114,V103)=1,V103,(COUNTIF(V$103:V$114,V103)*V103+VLOOKUP(COUNTIF(V$103:V$114,V103),$B$88:$C$99,2))/COUNTIF(V$103:V$114,V103))","v":4},null,{"$f":"Y6","v":5},{"$f":"IF(COUNTIF(Y$103:Y$114,Y103)=1,Y103,(COUNTIF(Y$103:Y$114,Y103)*Y103+VLOOKUP(COUNTIF(Y$103:Y$114,Y103),$B$88:$C$99,2))/COUNTIF(Y$103:Y$114,Y103))","v":5},null,{"$f":"AB6","v":5},{"$f":"IF(COUNTIF(AB$103:AB$114,AB103)=1,AB103,(COUNTIF(AB$103:AB$114,AB103)*AB103+VLOOKUP(COUNTIF(AB$103:AB$114,AB103),$B$88:$C$99,2))/COUNTIF(AB$103:AB$114,AB103))","v":5},null,{"$f":"AE6","v":2},{"$f":"IF(COUNTIF(AE$103:AE$114,AE103)=1,AE103,(COUNTIF(AE$103:AE$114,AE103)*AE103+VLOOKUP(COUNTIF(AE$103:AE$114,AE103),$B$88:$C$99,2))/COUNTIF(AE$103:AE$114,AE103))","v":2},null,null,{"$f":"AI6","v":0},{"$f":"IF(COUNTIF(AI$103:AI$114,AI103)=1,AI103,(COUNTIF(AI$103:AI$114,AI103)*AI103+VLOOKUP(COUNTIF(AI$103:AI$114,AI103),$B$88:$C$99,2))/COUNTIF(AI$103:AI$114,AI103))","v":5.5}]
[null,2,null,{"$f":"D11","v":5},{"$f":"IF(COUNTIF(D$103:D$114,D104)=1,D104,(COUNTIF(D$103:D$114,D104)*D104+VLOOKUP(COUNTIF(D$103:D$114,D104),$B$88:$C$99,2))/COUNTIF(D$103:D$114,D104))","v":5},null,{"$f":"G11","v":4},{"$f":"IF(COUNTIF(G$103:G$114,G104)=1,G104,(COUNTIF(G$103:G$114,G104)*G104+VLOOKUP(COUNTIF(G$103:G$114,G104),$B$88:$C$99,2))/COUNTIF(G$103:G$114,G104))","v":4},null,{"$f":"J11","v":4},{"$f":"IF(COUNTIF(J$103:J$114,J104)=1,J104,(COUNTIF(J$103:J$114,J104)*J104+VLOOKUP(COUNTIF(J$103:J$114,J104),$B$88:$C$99,2))/COUNTIF(J$103:J$114,J104))","v":4},null,{"$f":"M11","v":5},{"$f":"IF(COUNTIF(M$103:M$114,M104)=1,M104,(COUNTIF(M$103:M$114,M104)*M104+VLOOKUP(COUNTIF(M$103:M$114,M104),$B$88:$C$99,2))/COUNTIF(M$103:M$114,M104))","v":5},null,{"$f":"P11","v":1},{"$f":"IF(COUNTIF(P$103:P$114,P104)=1,P104,(COUNTIF(P$103:P$114,P104)*P104+VLOOKUP(COUNTIF(P$103:P$114,P104),$B$88:$C$99,2))/COUNTIF(P$103:P$114,P104))","v":1},null,{"$f":"S11","v":4},{"$f":"IF(COUNTIF(S$103:S$114,S104)=1,S104,(COUNTIF(S$103:S$114,S104)*S104+VLOOKUP(COUNTIF(S$103:S$114,S104),$B$88:$C$99,2))/COUNTIF(S$103:S$114,S104))","v":4},null,{"$f":"V11","v":2},{"$f":"IF(COUNTIF(V$103:V$114,V104)=1,V104,(COUNTIF(V$103:V$114,V104)*V104+VLOOKUP(COUNTIF(V$103:V$114,V104),$B$88:$C$99,2))/COUNTIF(V$103:V$114,V104))","v":2},null,{"$f":"Y11","v":3},{"$f":"IF(COUNTIF(Y$103:Y$114,Y104)=1,Y104,(COUNTIF(Y$103:Y$114,Y104)*Y104+VLOOKUP(COUNTIF(Y$103:Y$114,Y104),$B$88:$C$99,2))/COUNTIF(Y$103:Y$114,Y104))","v":3},null,{"$f":"AB11","v":4},{"$f":"IF(COUNTIF(AB$103:AB$114,AB104)=1,AB104,(COUNTIF(AB$103:AB$114,AB104)*AB104+VLOOKUP(COUNTIF(AB$103:AB$114,AB104),$B$88:$C$99,2))/COUNTIF(AB$103:AB$114,AB104))","v":4},null,{"$f":"AE11","v":1},{"$f":"IF(COUNTIF(AE$103:AE$114,AE104)=1,AE104,(COUNTIF(AE$103:AE$114,AE104)*AE104+VLOOKUP(COUNTIF(AE$103:AE$114,AE104),$B$88:$C$99,2))/COUNTIF(AE$103:AE$114,AE104))","v":1},null,null,{"$f":"AI11","v":0},{"$f":"IF(COUNTIF(AI$103:AI$114,AI104)=1,AI104,(COUNTIF(AI$103:AI$114,AI104)*AI104+VLOOKUP(COUNTIF(AI$103:AI$114,AI104),$B$88:$C$99,2))/COUNTIF(AI$103:AI$114,AI104))","v":5.5}]
[null,3,null,{"$f":"D16","v":4},4,null,{"$f":"G16","v":1},1,null,{"$f":"J16","v":3},3,null,{"$f":"M16","v":1},1,null,{"$f":"P16","v":5},5,null,{"$f":"S16","v":3},3,null,{"$f":"V16","v":5},5,null,{"$f":"Y16","v":4},4,null,{"$f":"AB16","v":3},3,null,{"$f":"AE16","v":5},5,null,null,{"$f":"AI16","v":0},5.5]
[null,4,null,{"$f":"D21","v":1},1,null,{"$f":"G21","v":3},3,null,{"$f":"J21","v":2},2,null,{"$f":"M21","v":3},3,null,{"$f":"P21","v":2},2,null,{"$f":"S21","v":2},2,null,{"$f":"V21","v":1},1,null,{"$f":"Y21","v":2},2,null,{"$f":"AB21","v":2},2,null,{"$f":"AE21","v":4},4,null,null,{"$f":"AI21","v":0},5.5]
[null,5,null,{"$f":"D26","v":2},2,null,{"$f":"G26","v":2},2,null,{"$f":"J26","v":1},1,null,{"$f":"M26","v":2},2,null,{"$f":"P26","v":3},3,null,{"$f":"S26","v":1},1,null,{"$f":"V26","v":3},3,null,{"$f":"Y26","v":1},1,null,{"$f":"AB26","v":1},1,null,{"$f":"AE26","v":3},3,null,null,{"$f":"AI26","v":0},5.5]
[null,6,null,{"$f":"D31","v":""},{"$error":"#VALUE!"},null,{"$f":"G31","v":""},{"$error":"#VALUE!"},null,{"$f":"J31","v":""},{"$error":"#VALUE!"},null,{"$f":"M31","v":""},{"$error":"#VALUE!"},null,{"$f":"P31","v":""},{"$error":"#VALUE!"},null,{"$f":"S31","v":""},{"$error":"#VALUE!"},null,{"$f":"V31","v":""},{"$error":"#VALUE!"},null,{"$f":"Y31","v":""},{"$error":"#VALUE!"},null,{"$f":"AB31","v":""},{"$error":"#VALUE!"},null,{"$f":"AE31","v":""},{"$error":"#VALUE!"},null,null,{"$f":"AI31","v":0},5.5]
[null,7,null,{"$f":"D36","v":""},{"$error":"#VALUE!"},null,{"$f":"G36","v":""},{"$error":"#VALUE!"},null,{"$f":"J36","v":""},{"$error":"#VALUE!"},null,{"$f":"M36","v":""},{"$error":"#VALUE!"},null,{"$f":"P36","v":""},{"$error":"#VALUE!"},null,{"$f":"S36","v":""},{"$error":"#VALUE!"},null,{"$f":"V36","v":""},{"$error":"#VALUE!"},null,{"$f":"Y36","v":""},{"$error":"#VALUE!"},null,{"$f":"AB36","v":""},{"$error":"#VALUE!"},null,{"$f":"AE36","v":""},{"$error":"#VALUE!"},null,null,{"$f":"AI36","v":0},5.5]
[null,8,null,{"$f":"D41","v":""},{"$error":"#VALUE!"},null,{"$f":"G41","v":""},{"$error":"#VALUE!"},null,{"$f":"J41","v":""},{"$error":"#VALUE!"},null,{"$f":"M41","v":""},{"$error":"#VALUE!"},null,{"$f":"P41","v":""},{"$error":"#VALUE!"},null,{"$f":"S41","v":""},{"$error":"#VALUE!"},null,{"$f":"V41","v":""},{"$error":"#VALUE!"},null,{"$f":"Y41","v":""},{"$error":"#VALUE!"},null,{"$f":"AB41","v":""},{"$error":"#VALUE!"},null,{"$f":"AE41","v":""},{"$error":"#VALUE!"},null,null,{"$f":"AI41","v":0},5.5]
[null,9,null,{"$f":"D46","v":""},{"$error":"#VALUE!"},null,{"$f":"G46","v":""},{"$error":"#VALUE!"},null,{"$f":"J46","v":""},{"$error":"#VALUE!"},null,{"$f":"M46","v":""},{"$error":"#VALUE!"},null,{"$f":"P46","v":""},{"$error":"#VALUE!"},null,{"$f":"S46","v":""},{"$error":"#VALUE!"},null,{"$f":"V46","v":""},{"$error":"#VALUE!"},null,{"$f":"Y46","v":""},{"$error":"#VALUE!"},null,{"$f":"AB46","v":""},{"$error":"#VALUE!"},null,{"$f":"AE46","v":""},{"$error":"#VALUE!"},null,null,{"$f":"AI46","v":0},5.5]
[null,10,null,{"$f":"D51","v":""},{"$error":"#VALUE!"},null,{"$f":"G51","v":""},{"$error":"#VALUE!"},null,{"$f":"J51","v":""},{"$error":"#VALUE!"},null,{"$f":"M51","v":""},{"$error":"#VALUE!"},null,{"$f":"P51","v":""},{"$error":"#VALUE!"},null,{"$f":"S51","v":""},{"$error":"#VALUE!"},null,{"$f":"V51","v":""},{"$error":"#VALUE!"},null,{"$f":"Y51","v":""},{"$error":"#VALUE!"},null,{"$f":"AB51","v":""},{"$error":"#VALUE!"},null,{"$f":"AE51","v":""},{"$error":"#VALUE!"},null,null,{"$f":"AI51","v":0},5.5]
[null,11,null,{"$f":"D56","v":""},{"$error":"#VALUE!"},null,{"$f":"G56","v":""},{"$error":"#VALUE!"},null,{"$f":"J56","v":""},{"$error":"#VALUE!"},null,{"$f":"M56","v":""},{"$error":"#VALUE!"},null,{"$f":"P56","v":""},{"$error":"#VALUE!"},null,{"$f":"S56","v":""},{"$error":"#VALUE!"},null,{"$f":"V56","v":""},{"$error":"#VALUE!"},null,{"$f":"Y56","v":""},{"$error":"#VALUE!"},null,{"$f":"AB56","v":""},{"$error":"#VALUE!"},null,{"$f":"AE56","v":""},{"$error":"#VALUE!"},null,null,{"$f":"AI56","v":0},5.5]
[null,12,null,{"$f":"D61","v":""},{"$error":"#VALUE!"},null,{"$f":"G61","v":""},{"$error":"#VALUE!"},null,{"$f":"J61","v":""},{"$error":"#VALUE!"},null,{"$f":"M61","v":""},{"$error":"#VALUE!"},null,{"$f":"P61","v":""},{"$error":"#VALUE!"},null,{"$f":"S61","v":""},{"$error":"#VALUE!"},null,{"$f":"V61","v":""},{"$error":"#VALUE!"},null,{"$f":"Y61","v":""},{"$error":"#VALUE!"},null,{"$f":"AB61","v":""},{"$error":"#VALUE!"},null,{"$f":"AE61","v":""},{"$error":"#VALUE!"},null,null,{"$f":"AI61","v":0},5.5]
[]
[]
[]
[]
[]
[null,1,"helyezés",{"$f":"IF(D5=0,IF(E$1=\"helyezés\",0,100000001),TRUNC(1/D5*10000000))","v":6619675145},{"$f":"RANK(D120,D$120:D$131,D$87-1)","v":3},null,{"$f":"IF(G5=0,IF(H$1=\"helyezés\",0,100000001),TRUNC(1/G5*10000000))","v":11817808781},{"$f":"RANK(G120,G$120:G$131,G$87-1)","v":5},null,{"$f":"IF(J5=0,IF(K$1=\"helyezés\",0,100000001),TRUNC(1/J5*10000000))","v":5630498533},{"$f":"RANK(J120,J$120:J$131,J$87-1)","v":5},null,{"$f":"IF(M5=0,IF(N$1=\"helyezés\",0,100000001),TRUNC(1/M5*10000000))","v":3925845147},{"$f":"RANK(M120,M$120:M$131,M$87-1)","v":4},null,{"$f":"IF(P5=0,IF(Q$1=\"helyezés\",0,100000001),TRUNC(1/P5*10000000))","v":38230088495},{"$f":"RANK(P120,P$120:P$131,P$87-1)","v":4},null,{"$f":"IF(S5=0,IF(T$1=\"helyezés\",0,100000001),TRUNC(1/S5*10000000))","v":8244274809},{"$f":"RANK(S120,S$120:S$131,S$87-1)","v":5},null,{"$f":"IF(V5=0,IF(W$1=\"helyezés\",0,100000001),TRUNC(1/V5*10000000))","v":5665202281},{"$f":"RANK(V120,V$120:V$131,V$87-1)","v":4},null,{"$f":"IF(Y5=0,IF(Z$1=\"helyezés\",0,100000001),TRUNC(1/Y5*10000000))","v":7921518291},{"$f":"RANK(Y120,Y$120:Y$131,Y$87-1)","v":5},null,{"$f":"IF(AB5=0,IF(AC$1=\"helyezés\",0,100000001),TRUNC(1/AB5*10000000))","v":6344543985},{"$f":"RANK(AB120,AB$120:AB$131,AB$87-1)","v":5},null,{"$f":"IF(AE5=0,IF(AF$1=\"helyezés\",0,100000001),TRUNC(1/AE5*10000000))","v":5000000},{"$f":"RANK(AE120,AE$120:AE$131,AE$87-1)","v":2},null,null,{"$f":"IF(AI5=0,IF(AJ$1=\"helyezés\",0,100000001),TRUNC(1/AI5*10000000))","v":100000001},{"$f":"RANK(AI120,AI$120:AI$131,AI$87-1)","v":1}]
[null,2,null,{"$f":"IF(D10=0,IF(E$1=\"helyezés\",0,100000001),TRUNC(1/D10*10000000))","v":6593909791},{"$f":"RANK(D121,D$120:D$131,D$87-1)","v":5},null,{"$f":"IF(G10=0,IF(H$1=\"helyezés\",0,100000001),TRUNC(1/G10*10000000))","v":11927112092},{"$f":"RANK(G121,G$120:G$131,G$87-1)","v":4},null,{"$f":"IF(J10=0,IF(K$1=\"helyezés\",0,100000001),TRUNC(1/J10*10000000))","v":5789720565},{"$f":"RANK(J121,J$120:J$131,J$87-1)","v":4},null,{"$f":"IF(M10=0,IF(N$1=\"helyezés\",0,100000001),TRUNC(1/M10*10000000))","v":3648186462},{"$f":"RANK(M121,M$120:M$131,M$87-1)","v":5},null,{"$f":"IF(P10=0,IF(Q$1=\"helyezés\",0,100000001),TRUNC(1/P10*10000000))","v":42002916869},{"$f":"RANK(P121,P$120:P$131,P$87-1)","v":1},null,{"$f":"IF(S10=0,IF(T$1=\"helyezés\",0,100000001),TRUNC(1/S10*10000000))","v":8736980483},{"$f":"RANK(S121,S$120:S$131,S$87-1)","v":4},null,{"$f":"IF(V10=0,IF(W$1=\"helyezés\",0,100000001),TRUNC(1/V10*10000000))","v":5712774398},{"$f":"RANK(V121,V$120:V$131,V$87-1)","v":2},null,{"$f":"IF(Y10=0,IF(Z$1=\"helyezés\",0,100000001),TRUNC(1/Y10*10000000))","v":8541769649},{"$f":"RANK(Y121,Y$120:Y$131,Y$87-1)","v":3},null,{"$f":"IF(AB10=0,IF(AC$1=\"helyezés\",0,100000001),TRUNC(1/AB10*10000000))","v":6402845709},{"$f":"RANK(AB121,AB$120:AB$131,AB$87-1)","v":4},null,{"$f":"IF(AE10=0,IF(AF$1=\"helyezés\",0,100000001),TRUNC(1/AE10*10000000))","v":10000000},{"$f":"RANK(AE121,AE$120:AE$131,AE$87-1)","v":1},null,null,{"$f":"IF(AI10=0,IF(AJ$1=\"helyezés\",0,100000001),TRUNC(1/AI10*10000000))","v":100000001},{"$f":"RANK(AI121,AI$120:AI$131,AI$87-1)","v":1}]
[null,3,null,{"$f":"IF(D15=0,IF(E$1=\"helyezés\",0,100000001),TRUNC(1/D15*10000000))","v":6600458365},4,null,{"$f":"IF(G15=0,IF(H$1=\"helyezés\",0,100000001),TRUNC(1/G15*10000000))","v":13872832369},1,null,{"$f":"IF(J15=0,IF(K$1=\"helyezés\",0,100000001),TRUNC(1/J15*10000000))","v":5968087310},3,null,{"$f":"IF(M15=0,IF(N$1=\"helyezés\",0,100000001),TRUNC(1/M15*10000000))","v":4159445407},1,null,{"$f":"IF(P15=0,IF(Q$1=\"helyezés\",0,100000001),TRUNC(1/P15*10000000))","v":38196286472},5,null,{"$f":"IF(S15=0,IF(T$1=\"helyezés\",0,100000001),TRUNC(1/S15*10000000))","v":9036711641},3,null,{"$f":"IF(V15=0,IF(W$1=\"helyezés\",0,100000001),TRUNC(1/V15*10000000))","v":5334321170},5,null,{"$f":"IF(Y15=0,IF(Z$1=\"helyezés\",0,100000001),TRUNC(1/Y15*10000000))","v":8049939439},4,null,{"$f":"IF(AB15=0,IF(AC$1=\"helyezés\",0,100000001),TRUNC(1/AB15*10000000))","v":6433358153},3,null,{"$f":"IF(AE15=0,IF(AF$1=\"helyezés\",0,100000001),TRUNC(1/AE15*10000000))","v":2000000},5,null,null,{"$f":"IF(AI15=0,IF(AJ$1=\"helyezés\",0,100000001),TRUNC(1/AI15*10000000))","v":100000001},1]
[null,4,null,{"$f":"IF(D20=0,IF(E$1=\"helyezés\",0,100000001),TRUNC(1/D20*10000000))","v":6791385002},1,null,{"$f":"IF(G20=0,IF(H$1=\"helyezés\",0,100000001),TRUNC(1/G20*10000000))","v":12909009412},3,null,{"$f":"IF(J20=0,IF(K$1=\"helyezés\",0,100000001),TRUNC(1/J20*10000000))","v":6189998567},2,null,{"$f":"IF(M20=0,IF(N$1=\"helyezés\",0,100000001),TRUNC(1/M20*10000000))","v":3973875448},3,null,{"$f":"IF(P20=0,IF(Q$1=\"helyezés\",0,100000001),TRUNC(1/P20*10000000))","v":40468384074},2,null,{"$f":"IF(S20=0,IF(T$1=\"helyezés\",0,100000001),TRUNC(1/S20*10000000))","v":9283335124},2,null,{"$f":"IF(V20=0,IF(W$1=\"helyezés\",0,100000001),TRUNC(1/V20*10000000))","v":5785843434},1,null,{"$f":"IF(Y20=0,IF(Z$1=\"helyezés\",0,100000001),TRUNC(1/Y20*10000000))","v":8764455264},2,null,{"$f":"IF(AB20=0,IF(AC$1=\"helyezés\",0,100000001),TRUNC(1/AB20*10000000))","v":6511908350},2,null,{"$f":"IF(AE20=0,IF(AF$1=\"helyezés\",0,100000001),TRUNC(1/AE20*10000000))","v":2500000},4,null,null,{"$f":"IF(AI20=0,IF(AJ$1=\"helyezés\",0,100000001),TRUNC(1/AI20*10000000))","v":100000001},1]
[null,5,null,{"$f":"IF(D25=0,IF(E$1=\"helyezés\",0,100000001),TRUNC(1/D25*10000000))","v":6743151486},2,null,{"$f":"IF(G25=0,IF(H$1=\"helyezés\",0,100000001),TRUNC(1/G25*10000000))","v":13608442274},2,null,{"$f":"IF(J25=0,IF(K$1=\"helyezés\",0,100000001),TRUNC(1/J25*10000000))","v":6243676831},1,null,{"$f":"IF(M25=0,IF(N$1=\"helyezés\",0,100000001),TRUNC(1/M25*10000000))","v":4121744108},2,null,{"$f":"IF(P25=0,IF(Q$1=\"helyezés\",0,100000001),TRUNC(1/P25*10000000))","v":39344262295},3,null,{"$f":"IF(S25=0,IF(T$1=\"helyezés\",0,100000001),TRUNC(1/S25*10000000))","v":9406641262},1,null,{"$f":"IF(V25=0,IF(W$1=\"helyezés\",0,100000001),TRUNC(1/V25*10000000))","v":5670035437},3,null,{"$f":"IF(Y25=0,IF(Z$1=\"helyezés\",0,100000001),TRUNC(1/Y25*10000000))","v":9049015500},1,null,{"$f":"IF(AB25=0,IF(AC$1=\"helyezés\",0,100000001),TRUNC(1/AB25*10000000))","v":6553895168},1,null,{"$f":"IF(AE25=0,IF(AF$1=\"helyezés\",0,100000001),TRUNC(1/AE25*10000000))","v":3333333},3,null,null,{"$f":"IF(AI25=0,IF(AJ$1=\"helyezés\",0,100000001),TRUNC(1/AI25*10000000))","v":100000001},1]
[null,6,null,{"$f":"IF(D30=0,IF(E$1=\"helyezés\",0,100000001),TRUNC(1/D30*10000000))","v":100000001},6,null,{"$f":"IF(G30=0,IF(H$1=\"helyezés\",0,100000001),TRUNC(1/G30*10000000))","v":100000001},6,null,{"$f":"IF(J30=0,IF(K$1=\"helyezés\",0,100000001),TRUNC(1/J30*10000000))","v":100000001},6,null,{"$f":"IF(M30=0,IF(N$1=\"helyezés\",0,100000001),TRUNC(1/M30*10000000))","v":100000001},6,null,{"$f":"IF(P30=0,IF(Q$1=\"helyezés\",0,100000001),TRUNC(1/P30*10000000))","v":100000001},6,null,{"$f":"IF(S30=0,IF(T$1=\"helyezés\",0,100000001),TRUNC(1/S30*10000000))","v":100000001},6,null,{"$f":"IF(V30=0,IF(W$1=\"helyezés\",0,100000001),TRUNC(1/V30*10000000))","v":100000001},6,null,{"$f":"IF(Y30=0,IF(Z$1=\"helyezés\",0,100000001),TRUNC(1/Y30*10000000))","v":100000001},6,null,{"$f":"IF(AB30=0,IF(AC$1=\"helyezés\",0,100000001),TRUNC(1/AB30*10000000))","v":100000001},6,null,{"$f":"IF(AE30=0,IF(AF$1=\"helyezés\",0,100000001),TRUNC(1/AE30*10000000))","v":0},6,null,null,{"$f":"IF(AI30=0,IF(AJ$1=\"helyezés\",0,100000001),TRUNC(1/AI30*10000000))","v":100000001},1]
[null,7,null,{"$f":"IF(D35=0,IF(E$1=\"helyezés\",0,100000001),TRUNC(1/D35*10000000))","v":100000001},6,null,{"$f":"IF(G35=0,IF(H$1=\"helyezés\",0,100000001),TRUNC(1/G35*10000000))","v":100000001},6,null,{"$f":"IF(J35=0,IF(K$1=\"helyezés\",0,100000001),TRUNC(1/J35*10000000))","v":100000001},6,null,{"$f":"IF(M35=0,IF(N$1=\"helyezés\",0,100000001),TRUNC(1/M35*10000000))","v":100000001},6,null,{"$f":"IF(P35=0,IF(Q$1=\"helyezés\",0,100000001),TRUNC(1/P35*10000000))","v":100000001},6,null,{"$f":"IF(S35=0,IF(T$1=\"helyezés\",0,100000001),TRUNC(1/S35*10000000))","v":100000001},6,null,{"$f":"IF(V35=0,IF(W$1=\"helyezés\",0,100000001),TRUNC(1/V35*10000000))","v":100000001},6,null,{"$f":"IF(Y35=0,IF(Z$1=\"helyezés\",0,100000001),TRUNC(1/Y35*10000000))","v":100000001},6,null,{"$f":"IF(AB35=0,IF(AC$1=\"helyezés\",0,100000001),TRUNC(1/AB35*10000000))","v":100000001},6,null,{"$f":"IF(AE35=0,IF(AF$1=\"helyezés\",0,100000001),TRUNC(1/AE35*10000000))","v":0},6,null,null,{"$f":"IF(AI35=0,IF(AJ$1=\"helyezés\",0,100000001),TRUNC(1/AI35*10000000))","v":100000001},1]
[null,8,null,{"$f":"IF(D40=0,IF(E$1=\"helyezés\",0,100000001),TRUNC(1/D40*10000000))","v":100000001},6,null,{"$f":"IF(G40=0,IF(H$1=\"helyezés\",0,100000001),TRUNC(1/G40*10000000))","v":100000001},6,null,{"$f":"IF(J40=0,IF(K$1=\"helyezés\",0,100000001),TRUNC(1/J40*10000000))","v":100000001},6,null,{"$f":"IF(M40=0,IF(N$1=\"helyezés\",0,100000001),TRUNC(1/M40*10000000))","v":100000001},6,null,{"$f":"IF(P40=0,IF(Q$1=\"helyezés\",0,100000001),TRUNC(1/P40*10000000))","v":100000001},6,null,{"$f":"IF(S40=0,IF(T$1=\"helyezés\",0,100000001),TRUNC(1/S40*10000000))","v":100000001},6,null,{"$f":"IF(V40=0,IF(W$1=\"helyezés\",0,100000001),TRUNC(1/V40*10000000))","v":100000001},6,null,{"$f":"IF(Y40=0,IF(Z$1=\"helyezés\",0,100000001),TRUNC(1/Y40*10000000))","v":100000001},6,null,{"$f":"IF(AB40=0,IF(AC$1=\"helyezés\",0,100000001),TRUNC(1/AB40*10000000))","v":100000001},6,null,{"$f":"IF(AE40=0,IF(AF$1=\"helyezés\",0,100000001),TRUNC(1/AE40*10000000))","v":0},6,null,null,{"$f":"IF(AI40=0,IF(AJ$1=\"helyezés\",0,100000001),TRUNC(1/AI40*10000000))","v":100000001},1]
[null,9,null,{"$f":"IF(D45=0,IF(E$1=\"helyezés\",0,100000001),TRUNC(1/D45*10000000))","v":100000001},6,null,{"$f":"IF(G45=0,IF(H$1=\"helyezés\",0,100000001),TRUNC(1/G45*10000000))","v":100000001},6,null,{"$f":"IF(J45=0,IF(K$1=\"helyezés\",0,100000001),TRUNC(1/J45*10000000))","v":100000001},6,null,{"$f":"IF(M45=0,IF(N$1=\"helyezés\",0,100000001),TRUNC(1/M45*10000000))","v":100000001},6,null,{"$f":"IF(P45=0,IF(Q$1=\"helyezés\",0,100000001),TRUNC(1/P45*10000000))","v":100000001},6,null,{"$f":"IF(S45=0,IF(T$1=\"helyezés\",0,100000001),TRUNC(1/S45*10000000))","v":100000001},6,null,{"$f":"IF(V45=0,IF(W$1=\"helyezés\",0,100000001),TRUNC(1/V45*10000000))","v":100000001},6,null,{"$f":"IF(Y45=0,IF(Z$1=\"helyezés\",0,100000001),TRUNC(1/Y45*10000000))","v":100000001},6,null,{"$f":"IF(AB45=0,IF(AC$1=\"helyezés\",0,100000001),TRUNC(1/AB45*10000000))","v":100000001},6,null,{"$f":"IF(AE45=0,IF(AF$1=\"helyezés\",0,100000001),TRUNC(1/AE45*10000000))","v":0},6,null,null,{"$f":"IF(AI45=0,IF(AJ$1=\"helyezés\",0,100000001),TRUNC(1/AI45*10000000))","v":100000001},1]
[null,10,null,{"$f":"IF(D50=0,IF(E$1=\"helyezés\",0,100000001),TRUNC(1/D50*10000000))","v":100000001},6,null,{"$f":"IF(G50=0,IF(H$1=\"helyezés\",0,100000001),TRUNC(1/G50*10000000))","v":100000001},6,null,{"$f":"IF(J50=0,IF(K$1=\"helyezés\",0,100000001),TRUNC(1/J50*10000000))","v":100000001},6,null,{"$f":"IF(M50=0,IF(N$1=\"helyezés\",0,100000001),TRUNC(1/M50*10000000))","v":100000001},6,null,{"$f":"IF(P50=0,IF(Q$1=\"helyezés\",0,100000001),TRUNC(1/P50*10000000))","v":100000001},6,null,{"$f":"IF(S50=0,IF(T$1=\"helyezés\",0,100000001),TRUNC(1/S50*10000000))","v":100000001},6,null,{"$f":"IF(V50=0,IF(W$1=\"helyezés\",0,100000001),TRUNC(1/V50*10000000))","v":100000001},6,null,{"$f":"IF(Y50=0,IF(Z$1=\"helyezés\",0,100000001),TRUNC(1/Y50*10000000))","v":100000001},6,null,{"$f":"IF(AB50=0,IF(AC$1=\"helyezés\",0,100000001),TRUNC(1/AB50*10000000))","v":100000001},6,null,{"$f":"IF(AE50=0,IF(AF$1=\"helyezés\",0,100000001),TRUNC(1/AE50*10000000))","v":0},6,null,null,{"$f":"IF(AI50=0,IF(AJ$1=\"helyezés\",0,100000001),TRUNC(1/AI50*10000000))","v":100000001},1]
[null,11,null,{"$f":"IF(D55=0,IF(E$1=\"helyezés\",0,100000001),TRUNC(1/D55*10000000))","v":100000001},6,null,{"$f":"IF(G55=0,IF(H$1=\"helyezés\",0,100000001),TRUNC(1/G55*10000000))","v":100000001},6,null,{"$f":"IF(J55=0,IF(K$1=\"helyezés\",0,100000001),TRUNC(1/J55*10000000))","v":100000001},6,null,{"$f":"IF(M55=0,IF(N$1=\"helyezés\",0,100000001),TRUNC(1/M55*10000000))","v":100000001},6,null,{"$f":"IF(P55=0,IF(Q$1=\"helyezés\",0,100000001),TRUNC(1/P55*10000000))","v":100000001},6,null,{"$f":"IF(S55=0,IF(T$1=\"helyezés\",0,100000001),TRUNC(1/S55*10000000))","v":100000001},6,null,{"$f":"IF(V55=0,IF(W$1=\"helyezés\",0,100000001),TRUNC(1/V55*10000000))","v":100000001},6,null,{"$f":"IF(Y55=0,IF(Z$1=\"helyezés\",0,100000001),TRUNC(1/Y55*10000000))","v":100000001},6,null,{"$f":"IF(AB55=0,IF(AC$1=\"helyezés\",0,100000001),TRUNC(1/AB55*10000000))","v":100000001},6,null,{"$f":"IF(AE55=0,IF(AF$1=\"helyezés\",0,100000001),TRUNC(1/AE55*10000000))","v":0},6,null,null,{"$f":"IF(AI55=0,IF(AJ$1=\"helyezés\",0,100000001),TRUNC(1/AI55*10000000))","v":100000001},1]
[null,12,null,{"$f":"IF(D60=0,IF(E$1=\"helyezés\",0,100000001),TRUNC(1/D60*10000000))","v":100000001},6,null,{"$f":"IF(G60=0,IF(H$1=\"helyezés\",0,100000001),TRUNC(1/G60*10000000))","v":100000001},6,null,{"$f":"IF(J60=0,IF(K$1=\"helyezés\",0,100000001),TRUNC(1/J60*10000000))","v":100000001},6,null,{"$f":"IF(M60=0,IF(N$1=\"helyezés\",0,100000001),TRUNC(1/M60*10000000))","v":100000001},6,null,{"$f":"IF(P60=0,IF(Q$1=\"helyezés\",0,100000001),TRUNC(1/P60*10000000))","v":100000001},6,null,{"$f":"IF(S60=0,IF(T$1=\"helyezés\",0,100000001),TRUNC(1/S60*10000000))","v":100000001},6,null,{"$f":"IF(V60=0,IF(W$1=\"helyezés\",0,100000001),TRUNC(1/V60*10000000))","v":100000001},6,null,{"$f":"IF(Y60=0,IF(Z$1=\"helyezés\",0,100000001),TRUNC(1/Y60*10000000))","v":100000001},6,null,{"$f":"IF(AB60=0,IF(AC$1=\"helyezés\",0,100000001),TRUNC(1/AB60*10000000))","v":100000001},6,null,{"$f":"IF(AE60=0,IF($AF$1=\"helyezés\",0,100000001),TRUNC(1/AE60*10000000))","v":0},6,null,null,{"$f":"IF(AI60=0,IF($AF$1=\"helyezés\",0,100000001),TRUNC(1/AI60*10000000))","v":0},12]

{"sheet":"Versenyszámok","index":1,"n_rows":40,"n_cols":14,"rows_kept":40,"cut":false,"hidden":false,"merged":[]}
["Versenyszámok:",1,{"$f":"CONCATENATE(VLOOKUP(D1,$K$1:$N$29,3,0),\"/\",VLOOKUP(D1,$K$1:$N$29,4,0),\".\")","v":"1/2."},"Futás váltóbottal",{"$f":"VLOOKUP(D1,$K$1:$L$29,2,0)","v":"idő"},null,null,null,null,1,"Krumpliültetés","idő",1,1]
[null,2,{"$f":"CONCATENATE(VLOOKUP(D2,$K$1:$N$29,3,0),\"/\",VLOOKUP(D2,$K$1:$N$29,4,0),\".\")","v":"2/1."},"Négykézlábjárás","idő",null,null,null,null,null,"Futás váltóbottal","idő",1,2]
[null,3,"3/2.","Alagúton át","idő",null,null,null,null,null,"Társhordás karikával","idő",1,3]
[null,4,"4/3.","Labdás ügyességi váltó","idő",null,null,null,null,2,"Négykézlábjárás","idő",2,1]
[null,5,"5/3.","Hídakadály","idő",null,null,null,null,null,"Pókjárás - Rákjárás","idő",2,2]
[null,6,"6/3.","Bújj és karikában fuss","idő",null,null,null,null,null,"Talicskaváltó","idő",2,3]
[null,7,"7/1.","Karikarakó","idő",null,null,null,null,3,"Akadálypálya","idő",3,1]
[null,8,"8/2.","Szlalom kézilabda","idő",null,null,null,null,null,"Alagúton át","idő",3,2]
[null,9,"9/1.","Karikán az akadályra","idő",null,null,null,null,null,"Gátakadály","idő",3,3]
[null,10,"10/2.","Bombázó",{"$f":"VLOOKUP(D10,$K$1:$L$29,2,0)","v":"helyezés"},null,null,null,null,4,"Utazó labda","idő",4,1]
[null,"Holtverseny",{"$f":"IF(D11=\"\",\"\",CONCATENATE(VLOOKUP(D11,$K$1:$N$29,3,0),\"/\",VLOOKUP(D10,$K$1:$N$29,4,0),\".\"))","v":"3/2."},"Akadálypálya",{"$f":"VLOOKUP(D11,$K$1:$L$29,2,0)","v":"idő"},null,null,null,null,null,"Floorball-váltó","idő",4,2]
[null,null,null,null,null,null,null,null,null,null,"Labdás ügyességi váltó","idő",4,3]
["Helyszín:",null,null,null,null,null,null,null,null,5,"Kötélhajtás","pont",5,1]
["Dátum:","2016-02-22",null,null,null,null,null,null,null,null,"Várfoglaló","idő",5,2]
[null,null,null,null,null,null,null,null,null,null,"Hídakadály","idő",5,3]
[null,null,null,null,null,null,null,null,null,6,"Labdahordás","idő",6,1]
[null,null,null,null,null,null,null,null,null,null,"Páros adogatás","idő",6,2]
[null,null,null,null,null,null,null,null,null,null,"Bújj és karikában fuss","idő",6,3]
[null,null,null,null,null,null,null,null,null,7,"Karikarakó","idő",7,1]
[null,null,null,null,null,null,null,null,null,null,"Kalapos váltó","idő",7,2]
[null,null,null,null,null,null,null,null,null,null,"Rakd a botot - Szedd a botot","idő",7,3]
[null,null,null,null,null,null,null,null,null,8,"Szlalomozz a labdával","idő",8,1]
[null,null,null,null,null,null,null,null,null,null,"Szlalom kézilabda","idő",8,2]
[null,null,null,null,null,null,null,null,null,null,"Ügyeskedj a labdával","idő",8,3]
[null,null,null,null,null,null,null,null,null,9,"Karikán az akadályra","idő",9,1]
[null,null,null,null,null,null,null,null,null,null,"Akadályon át","idő",9,2]
[null,null,null,null,null,null,null,null,null,null,"Alagútakadály","idő",9,3]
[null,null,null,null,null,null,null,null,null,10,"Kötélhúzás","helyezés",10,1]
[null,null,null,null,null,null,null,null,null,null,"Bombázó","helyezés",10,2]
[]
[]
[]
[]
[]
[]
[]
[]
[]
[]
[{"$f":"TODAY()","v":"2016-02-22"}]

{"sheet":"Nyomtatás","index":2,"n_rows":157,"n_cols":16,"rows_kept":157,"cut":false,"hidden":false,"merged":[[41,0,45,0],[46,0,50,0],[51,0,55,0],[56,0,60,0],[36,4,40,4],[36,0,40,0],[36,2,36,3],[37,2,37,3],[38,2,38,3],[39,2,39,3],[41,2,41,3],[41,4,45,4],[42,2,42,3],[43,2,43,3],[44,2,44,3],[46,2,46,3],[1,4,5,4],[6,4,10,4],[11,4,15,4],[16,4,20,4],[21,4,25,4],[26,4,30,4],[31,4,35,4],[26,0,30,0],[26,2,26,3],[27,2,27,3],[28,2,28,3],[29,2,29,3],[31,0,35,0],[31,2,31,3],[32,2,32,3],[33,2,33,3],[34,2,34,3],[16,0,20,0],[16,2,16,3],[17,2,17,3],[18,2,18,3],[19,2,19,3],[21,0,25,0],[21,2,21,3],[22,2,22,3],[23,2,23,3],[24,2,24,3],[0,2,0,3],[1,0,5,0],[1,2,1,3],[2,2,2,3],[3,2,3,3],[4,2,4,3],[11,0,15,0],[11,2,11,3],[12,2,12,3],[13,2,13,3],[14,2,14,3],[6,0,10,0],[6,2,6,3],[7,2,7,3],[8,2,8,3],[9,2,9,3],[46,4,50,4],[47,2,47,3],[48,2,48,3],[49,2,49,3],[51,2,51,3],[51,4,55,4],[52,2,52,3],[53,2,53,3],[54,2,54,3],[56,2,56,3],[56,4,60,4],[57,2,57,3],[58,2,58,3],[59,2,59,3]]}
["Csapatok","Versenyszám:",{"$f":"CONCATENATE(VLOOKUP(G1,Versenyszámok!B1:D10,2),\" \",VLOOKUP(G1,Versenyszámok!B1:D10,3))","v":"10/2. Bombázó"},null,"H.","Versenyszám:",10,null,null,null,null,null,null,null,null,1]
[{"$f":"IF(ISBLANK(Jegyzőkönyv!B3),\"\",Jegyzőkönyv!B3)","v":"Pécs"},"Idő (p:mp:tmp):",{"$f":"INDEX($B$101:$K$112,O2,$G$1)","v":2},null,{"$f":"Jegyzőkönyv!AH3","v":5},null,null,null,null,null,null,null,null,null,1,2]
[null,"Hiba (p:mp:tmp):",{"$f":"INDEX($B$122:$K$133,O2,$G$1)","v":"00:00:00"},null,null,null,null,null,null,null,null,null,null,null,null,3]
[null,"Össz.idő",{"$f":"SUM(C2:D3)","v":2},null,null,null,null,null,null,null,null,null,null,null,null,4]
[null,"Helyezés",{"$f":"IF(ISBLANK(C2),\"\",INDEX($B$68:$K$79,O2,$G$1))","v":2},null,null,null,null,null,null,null,null,null,null,null,null,5]
[null,"Pont/Összp.",{"$f":"INDEX($B$140:$K$151,O2,$G$1)","v":4},{"$f":"INDEX($B$84:$K$95,O2,$G$1)","v":18},null,null,null,null,null,null,null,null,null,null,null,6]
[{"$f":"IF(ISBLANK(Jegyzőkönyv!B8),\"\",Jegyzőkönyv!B8)","v":"Békés"},"Idő (p:mp:tmp):",{"$f":"INDEX($B$101:$K$112,O7,$G$1)","v":1},null,{"$f":"Jegyzőkönyv!AH8","v":3},null,null,null,null,null,null,null,null,null,2,7]
[null,"Hiba (p:mp:tmp):",{"$f":"INDEX($B$122:$K$133,O7,$G$1)","v":"00:00:00"},null,null,null,null,null,null,null,null,null,null,null,null,8]
[null,"Össz.idő",{"$f":"SUM(C7:D8)","v":1},null,null,null,null,null,null,null,null,null,null,null,null,9]
[null,"Helyezés",{"$f":"IF(ISBLANK(C7),\"\",INDEX($B$68:$K$79,O7,$G$1))","v":1},null,null,null,null,null,null,null,null,null,null,null,null,10]
[null,"Pont/Összp.",{"$f":"INDEX($B$140:$K$151,O7,$G$1)","v":5},{"$f":"INDEX($B$84:$K$95,O7,$G$1)","v":27}]
[{"$f":"IF(ISBLANK(Jegyzőkönyv!B13),\"\",Jegyzőkönyv!B13)","v":"Hajdúböszörmény"},"Idő (p:mp:tmp):",{"$f":"INDEX($B$101:$K$112,O12,$G$1)","v":5},null,{"$f":"Jegyzőkönyv!AH13","v":4},null,null,null,null,null,null,null,null,null,3]
[null,"Hiba (p:mp:tmp):",{"$f":"INDEX($B$122:$K$133,O12,$G$1)","v":"00:00:00"}]
[null,"Össz.idő",{"$f":"SUM(C12:D13)","v":5}]
[null,"Helyezés",{"$f":"IF(ISBLANK(C12),\"\",INDEX($B$68:$K$79,O12,$G$1))","v":5}]
[null,"Pont/Összp.",{"$f":"INDEX($B$140:$K$151,O12,$G$1)","v":1},{"$f":"INDEX($B$84:$K$95,O12,$G$1)","v":26}]
[{"$f":"IF(ISBLANK(Jegyzőkönyv!B18),\"\",Jegyzőkönyv!B18)","v":"Törökbálint"},"Idő (p:mp:tmp):",{"$f":"INDEX($B$101:$K$112,O17,$G$1)","v":4},null,{"$f":"Jegyzőkönyv!AH18","v":2},null,null,null,null,null,null,null,null,null,4]
[null,"Hiba (p:mp:tmp):",{"$f":"INDEX($B$122:$K$133,O17,$G$1)","v":"00:00:00"}]
[null,"Össz.idő",{"$f":"SUM(C17:D18)","v":4}]
[null,"Helyezés",{"$f":"IF(ISBLANK(C17),\"\",INDEX($B$68:$K$79,O17,$G$1))","v":4}]
[null,"Pont/Összp.",{"$f":"INDEX($B$140:$K$151,O17,$G$1)","v":2},{"$f":"INDEX($B$84:$K$95,O17,$G$1)","v":38}]
[{"$f":"IF(ISBLANK(Jegyzőkönyv!B23),\"\",Jegyzőkönyv!B23)","v":"Szombathely"},"Idő (p:mp:tmp):",{"$f":"INDEX($B$101:$K$112,O22,$G$1)","v":3},null,{"$f":"Jegyzőkönyv!AH23","v":1},null,null,null,null,null,null,null,null,null,5]
[null,"Hiba (p:mp:tmp):",{"$f":"INDEX($B$122:$K$133,O22,$G$1)","v":"00:00:00"}]
[null,"Össz.idő",{"$f":"SUM(C22:D23)","v":3}]
[null,"Helyezés",{"$f":"IF(ISBLANK(C22),\"\",INDEX($B$68:$K$79,O22,$G$1))","v":3}]
[null,"Pont/Összp.",{"$f":"INDEX($B$140:$K$151,O22,$G$1)","v":3},{"$f":"INDEX($B$84:$K$95,O22,$G$1)","v":41}]
[{"$f":"IF(ISBLANK(Jegyzőkönyv!B28),\"\",Jegyzőkönyv!B28)","v":""},"Idő (p:mp:tmp):",{"$f":"INDEX($B$101:$K$112,O27,$G$1)","v":"00:00:00"},null,{"$f":"Jegyzőkönyv!AH28","v":""},null,null,null,null,null,null,null,null,null,6]
[null,"Hiba (p:mp:tmp):",{"$f":"INDEX($B$122:$K$133,O27,$G$1)","v":"00:00:00"}]
[null,"Össz.idő",{"$f":"SUM(C27:D28)","v":"00:00:00"}]
[null,"Helyezés",{"$f":"IF(ISBLANK(C27),\"\",INDEX($B$68:$K$79,O27,$G$1))","v":""}]
[null,"Pont/Összp.",{"$f":"INDEX($B$140:$K$151,O27,$G$1)","v":""},{"$f":"INDEX($B$84:$K$95,O27,$G$1)","v":""}]
[{"$f":"IF(ISBLANK(Jegyzőkönyv!B33),\"\",Jegyzőkönyv!B33)","v":""},"Idő (p:mp:tmp):",{"$f":"INDEX($B$101:$K$112,O32,$G$1)","v":"00:00:00"},null,{"$f":"Jegyzőkönyv!AH33","v":""},null,null,null,null,null,null,null,null,null,7]
[null,"Hiba (p:mp:tmp):",{"$f":"INDEX($B$122:$K$133,O32,$G$1)","v":"00:00:00"}]
[null,"Össz.idő",{"$f":"SUM(C32:D33)","v":"00:00:00"}]
[null,"Helyezés",{"$f":"IF(ISBLANK(C32),\"\",INDEX($B$68:$K$79,O32,$G$1))","v":""}]
[null,"Pont/Összp.",{"$f":"INDEX($B$140:$K$151,O32,$G$1)","v":""},{"$f":"INDEX($B$84:$K$95,O32,$G$1)","v":""}]
[{"$f":"IF(ISBLANK(Jegyzőkönyv!B38),\"\",Jegyzőkönyv!B38)","v":""},"Idő (p:mp:tmp):",{"$f":"INDEX($B$101:$K$112,O37,$G$1)","v":"00:00:00"},null,{"$f":"Jegyzőkönyv!AH38","v":""},null,null,null,null,null,null,null,null,null,8]
[null,"Hiba (p:mp:tmp):",{"$f":"INDEX($B$122:$K$133,O37,$G$1)","v":"00:00:00"}]
[null,"Össz.idő",{"$f":"SUM(C37:D38)","v":"00:00:00"}]
[null,"Helyezés",{"$f":"IF(ISBLANK(C37),\"\",INDEX($B$68:$K$79,O37,$G$1))","v":""}]
[null,"Pont/Összp.",{"$f":"INDEX($B$140:$K$151,O37,$G$1)","v":""},{"$f":"INDEX($B$84:$K$95,O37,$G$1)","v":""}]
[{"$f":"IF(ISBLANK(Jegyzőkönyv!B43),\"\",Jegyzőkönyv!B43)","v":""},"Idő (p:mp:tmp):",{"$f":"INDEX($B$101:$K$112,O42,$G$1)","v":"00:00:00"},null,{"$f":"Jegyzőkönyv!AH43","v":""},null,null,null,null,null,null,null,null,null,9]
[null,"Hiba (p:mp:tmp):",{"$f":"INDEX($B$122:$K$133,O42,$G$1)","v":"00:00:00"}]
[null,"Össz.idő",{"$f":"SUM(C42:D43)","v":"00:00:00"}]
[null,"Helyezés",{"$f":"IF(ISBLANK(C42),\"\",INDEX($B$68:$K$79,O42,$G$1))","v":""}]
[null,"Pont/Összp.",{"$f":"INDEX($B$140:$K$151,O42,$G$1)","v":""},{"$f":"INDEX($B$84:$K$95,O42,$G$1)","v":""}]
[{"$f":"IF(ISBLANK(Jegyzőkönyv!B48),\"\",Jegyzőkönyv!B48)","v":""},"Idő (p:mp:tmp):",{"$f":"INDEX($B$101:$K$112,O47,$G$1)","v":"00:00:00"},null,{"$f":"Jegyzőkönyv!AH48","v":""},null,null,null,null,null,null,null,null,null,10]
[null,"Hiba (p:mp:tmp):",{"$f":"INDEX($B$122:$K$133,O47,$G$1)","v":"00:00:00"}]
[null,"Össz.idő",{"$f":"SUM(C47:D48)","v":"00:00:00"}]
[null,"Helyezés",{"$f":"IF(ISBLANK(C47),\"\",INDEX($B$68:$K$79,O47,$G$1))","v":""}]
[null,"Pont/Összp.",{"$f":"INDEX($B$140:$K$151,O47,$G$1)","v":""},{"$f":"INDEX($B$84:$K$95,O47,$G$1)","v":""}]
[{"$f":"IF(ISBLANK(Jegyzőkönyv!B53),\"\",Jegyzőkönyv!B53)","v":""},"Idő (p:mp:tmp):",{"$f":"INDEX($B$101:$K$112,O52,$G$1)","v":"00:00:00"},null,{"$f":"Jegyzőkönyv!AH53","v":""},null,null,null,null,null,null,null,null,null,11]
[null,"Hiba (p:mp:tmp):",{"$f":"INDEX($B$122:$K$133,O52,$G$1)","v":"00:00:00"}]
[null,"Össz.idő",{"$f":"SUM(C52:D53)","v":"00:00:00"}]
[null,"Helyezés",{"$f":"IF(ISBLANK(C52),\"\",INDEX($B$68:$K$79,O52,$G$1))","v":""}]
[null,"Pont/Összp.",{"$f":"INDEX($B$140:$K$151,O52,$G$1)","v":""},{"$f":"INDEX($B$84:$K$95,O52,$G$1)","v":""}]
[{"$f":"IF(ISBLANK(Jegyzőkönyv!B58),\"\",Jegyzőkönyv!B58)","v":""},"Idő (p:mp:tmp):",{"$f":"INDEX($B$101:$K$112,O57,$G$1)","v":"00:00:00"},null,{"$f":"Jegyzőkönyv!AH58","v":""},null,null,null,null,null,null,null,null,null,12]
[null,"Hiba (p:mp:tmp):",{"$f":"INDEX($B$122:$K$133,O57,$G$1)","v":"00:00:00"}]
[null,"Össz.idő",{"$f":"SUM(C57:D58)","v":"00:00:00"}]
[null,"Helyezés",{"$f":"IF(ISBLANK(C57),\"\",INDEX($B$68:$K$79,O57,$G$1))","v":""}]
[null,"Pont/Összp.",{"$f":"INDEX($B$140:$K$151,O57,$G$1)","v":""},{"$f":"INDEX($B$84:$K$95,O57,$G$1)","v":""}]
[]
[]
[]
[]
["helyezés (versenyszám)"]
[null,"1.","2.","3.","4.","5.","6.","7.","8.","9.","10."]
["1.",{"$f":"Jegyzőkönyv!D6","v":3},{"$f":"Jegyzőkönyv!G6","v":5},{"$f":"Jegyzőkönyv!J6","v":5},{"$f":"Jegyzőkönyv!M6","v":4},{"$f":"Jegyzőkönyv!P6","v":4},{"$f":"Jegyzőkönyv!S6","v":5},{"$f":"Jegyzőkönyv!V6","v":4},{"$f":"Jegyzőkönyv!Y6","v":5},{"$f":"Jegyzőkönyv!AB6","v":5},{"$f":"Jegyzőkönyv!AE6","v":2}]
["2.",{"$f":"Jegyzőkönyv!D11","v":5},{"$f":"Jegyzőkönyv!G11","v":4},{"$f":"Jegyzőkönyv!J11","v":4},{"$f":"Jegyzőkönyv!M11","v":5},{"$f":"Jegyzőkönyv!P11","v":1},{"$f":"Jegyzőkönyv!S11","v":4},{"$f":"Jegyzőkönyv!V11","v":2},{"$f":"Jegyzőkönyv!Y11","v":3},{"$f":"Jegyzőkönyv!AB11","v":4},{"$f":"Jegyzőkönyv!AE11","v":1}]
["3.",{"$f":"Jegyzőkönyv!D16","v":4},{"$f":"Jegyzőkönyv!G16","v":1},{"$f":"Jegyzőkönyv!J16","v":3},{"$f":"Jegyzőkönyv!M16","v":1},{"$f":"Jegyzőkönyv!P16","v":5},{"$f":"Jegyzőkönyv!S16","v":3},{"$f":"Jegyzőkönyv!V16","v":5},{"$f":"Jegyzőkönyv!Y16","v":4},{"$f":"Jegyzőkönyv!AB16","v":3},{"$f":"Jegyzőkönyv!AE16","v":5}]
["4.",{"$f":"Jegyzőkönyv!D21","v":1},{"$f":"Jegyzőkönyv!G21","v":3},{"$f":"Jegyzőkönyv!J21","v":2},{"$f":"Jegyzőkönyv!M21","v":3},{"$f":"Jegyzőkönyv!P21","v":2},{"$f":"Jegyzőkönyv!S21","v":2},{"$f":"Jegyzőkönyv!V21","v":1},{"$f":"Jegyzőkönyv!Y21","v":2},{"$f":"Jegyzőkönyv!AB21","v":2},{"$f":"Jegyzőkönyv!AE21","v":4}]
["5.",{"$f":"Jegyzőkönyv!D26","v":2},{"$f":"Jegyzőkönyv!G26","v":2},{"$f":"Jegyzőkönyv!J26","v":1},{"$f":"Jegyzőkönyv!M26","v":2},{"$f":"Jegyzőkönyv!P26","v":3},{"$f":"Jegyzőkönyv!S26","v":1},{"$f":"Jegyzőkönyv!V26","v":3},{"$f":"Jegyzőkönyv!Y26","v":1},{"$f":"Jegyzőkönyv!AB26","v":1},{"$f":"Jegyzőkönyv!AE26","v":3}]
["6.",{"$f":"Jegyzőkönyv!D31","v":""},{"$f":"Jegyzőkönyv!G31","v":""},{"$f":"Jegyzőkönyv!J31","v":""},{"$f":"Jegyzőkönyv!M31","v":""},{"$f":"Jegyzőkönyv!P31","v":""},{"$f":"Jegyzőkönyv!S31","v":""},{"$f":"Jegyzőkönyv!V31","v":""},{"$f":"Jegyzőkönyv!Y31","v":""},{"$f":"Jegyzőkönyv!AB31","v":""},{"$f":"Jegyzőkönyv!AE31","v":""}]
["7.",{"$f":"Jegyzőkönyv!D36","v":""},{"$f":"Jegyzőkönyv!G36","v":""},{"$f":"Jegyzőkönyv!J36","v":""},{"$f":"Jegyzőkönyv!M36","v":""},{"$f":"Jegyzőkönyv!P36","v":""},{"$f":"Jegyzőkönyv!S36","v":""},{"$f":"Jegyzőkönyv!V36","v":""},{"$f":"Jegyzőkönyv!Y36","v":""},{"$f":"Jegyzőkönyv!AB36","v":""},{"$f":"Jegyzőkönyv!AE36","v":""}]
["8.",{"$f":"Jegyzőkönyv!D41","v":""},{"$f":"Jegyzőkönyv!G41","v":""},{"$f":"Jegyzőkönyv!J41","v":""},{"$f":"Jegyzőkönyv!M41","v":""},{"$f":"Jegyzőkönyv!P41","v":""},{"$f":"Jegyzőkönyv!S41","v":""},{"$f":"Jegyzőkönyv!V41","v":""},{"$f":"Jegyzőkönyv!Y41","v":""},{"$f":"Jegyzőkönyv!AB41","v":""},{"$f":"Jegyzőkönyv!AE41","v":""}]
["9.",{"$f":"Jegyzőkönyv!D46","v":""},{"$f":"Jegyzőkönyv!G46","v":""},{"$f":"Jegyzőkönyv!J46","v":""},{"$f":"Jegyzőkönyv!M46","v":""},{"$f":"Jegyzőkönyv!P46","v":""},{"$f":"Jegyzőkönyv!S46","v":""},{"$f":"Jegyzőkönyv!V46","v":""},{"$f":"Jegyzőkönyv!Y46","v":""},{"$f":"Jegyzőkönyv!AB46","v":""},{"$f":"Jegyzőkönyv!AE46","v":""}]
["10.",{"$f":"Jegyzőkönyv!D51","v":""},{"$f":"Jegyzőkönyv!G51","v":""},{"$f":"Jegyzőkönyv!J51","v":""},{"$f":"Jegyzőkönyv!M51","v":""},{"$f":"Jegyzőkönyv!P51","v":""},{"$f":"Jegyzőkönyv!S51","v":""},{"$f":"Jegyzőkönyv!V51","v":""},{"$f":"Jegyzőkönyv!Y51","v":""},{"$f":"Jegyzőkönyv!AB51","v":""},{"$f":"Jegyzőkönyv!AE51","v":""}]
["11.",{"$f":"Jegyzőkönyv!D56","v":""},{"$f":"Jegyzőkönyv!G56","v":""},{"$f":"Jegyzőkönyv!J56","v":""},{"$f":"Jegyzőkönyv!M56","v":""},{"$f":"Jegyzőkönyv!P56","v":""},{"$f":"Jegyzőkönyv!S56","v":""},{"$f":"Jegyzőkönyv!V56","v":""},{"$f":"Jegyzőkönyv!Y56","v":""},{"$f":"Jegyzőkönyv!AB56","v":""},{"$f":"Jegyzőkönyv!AE56","v":""}]
["12.",{"$f":"Jegyzőkönyv!D61","v":""},{"$f":"Jegyzőkönyv!G61","v":""},{"$f":"Jegyzőkönyv!J61","v":""},{"$f":"Jegyzőkönyv!M61","v":""},{"$f":"Jegyzőkönyv!P61","v":""},{"$f":"Jegyzőkönyv!S61","v":""},{"$f":"Jegyzőkönyv!V61","v":""},{"$f":"Jegyzőkönyv!Y61","v":""},{"$f":"Jegyzőkönyv!AB61","v":""},{"$f":"Jegyzőkönyv!AE61","v":""}]
[]
[]
["összpontok (versenyszámonként)"]
[null,"1.","2.","3.","4.","5.","6.","7.","8.","9.","10."]
["1.",{"$f":"Jegyzőkönyv!E7","v":3},{"$f":"Jegyzőkönyv!H7","v":4},{"$f":"Jegyzőkönyv!K7","v":5},{"$f":"Jegyzőkönyv!N7","v":7},{"$f":"Jegyzőkönyv!Q7","v":9},{"$f":"Jegyzőkönyv!T7","v":10},{"$f":"Jegyzőkönyv!W7","v":12},{"$f":"Jegyzőkönyv!Z7","v":13},{"$f":"Jegyzőkönyv!AC7","v":14},{"$f":"Jegyzőkönyv!AF7","v":18}]
["2.",{"$f":"Jegyzőkönyv!E12","v":1},{"$f":"Jegyzőkönyv!H12","v":3},{"$f":"Jegyzőkönyv!K12","v":5},{"$f":"Jegyzőkönyv!N12","v":6},{"$f":"Jegyzőkönyv!Q12","v":11},{"$f":"Jegyzőkönyv!T12","v":13},{"$f":"Jegyzőkönyv!W12","v":17},{"$f":"Jegyzőkönyv!Z12","v":20},{"$f":"Jegyzőkönyv!AC12","v":22},{"$f":"Jegyzőkönyv!AF12","v":27}]
["3.",{"$f":"Jegyzőkönyv!E17","v":2},{"$f":"Jegyzőkönyv!H17","v":7},{"$f":"Jegyzőkönyv!K17","v":10},{"$f":"Jegyzőkönyv!N17","v":15},{"$f":"Jegyzőkönyv!Q17","v":16},{"$f":"Jegyzőkönyv!T17","v":19},{"$f":"Jegyzőkönyv!W17","v":20},{"$f":"Jegyzőkönyv!Z17","v":22},{"$f":"Jegyzőkönyv!AC17","v":25},{"$f":"Jegyzőkönyv!AF17","v":26}]
["4.",{"$f":"Jegyzőkönyv!E22","v":5},{"$f":"Jegyzőkönyv!H22","v":8},{"$f":"Jegyzőkönyv!K22","v":12},{"$f":"Jegyzőkönyv!N22","v":15},{"$f":"Jegyzőkönyv!Q22","v":19},{"$f":"Jegyzőkönyv!T22","v":23},{"$f":"Jegyzőkönyv!W22","v":28},{"$f":"Jegyzőkönyv!Z22","v":32},{"$f":"Jegyzőkönyv!AC22","v":36},{"$f":"Jegyzőkönyv!AF22","v":38}]
["5.",{"$f":"Jegyzőkönyv!E27","v":4},{"$f":"Jegyzőkönyv!H27","v":8},{"$f":"Jegyzőkönyv!K27","v":13},{"$f":"Jegyzőkönyv!N27","v":17},{"$f":"Jegyzőkönyv!Q27","v":20},{"$f":"Jegyzőkönyv!T27","v":25},{"$f":"Jegyzőkönyv!W27","v":28},{"$f":"Jegyzőkönyv!Z27","v":33},{"$f":"Jegyzőkönyv!AC27","v":38},{"$f":"Jegyzőkönyv!AF27","v":41}]
["6.",{"$f":"Jegyzőkönyv!E32","v":""},{"$f":"Jegyzőkönyv!H32","v":""},{"$f":"Jegyzőkönyv!K32","v":""},{"$f":"Jegyzőkönyv!N32","v":""},{"$f":"Jegyzőkönyv!Q32","v":""},{"$f":"Jegyzőkönyv!T32","v":""},{"$f":"Jegyzőkönyv!W32","v":""},{"$f":"Jegyzőkönyv!Z32","v":""},{"$f":"Jegyzőkönyv!AC32","v":""},{"$f":"Jegyzőkönyv!AF32","v":""}]
["7.",{"$f":"Jegyzőkönyv!E37","v":""},{"$f":"Jegyzőkönyv!H37","v":""},{"$f":"Jegyzőkönyv!K37","v":""},{"$f":"Jegyzőkönyv!N37","v":""},{"$f":"Jegyzőkönyv!Q37","v":""},{"$f":"Jegyzőkönyv!T37","v":""},{"$f":"Jegyzőkönyv!W37","v":""},{"$f":"Jegyzőkönyv!Z37","v":""},{"$f":"Jegyzőkönyv!AC37","v":""},{"$f":"Jegyzőkönyv!AF37","v":""}]
["8.",{"$f":"Jegyzőkönyv!E42","v":""},{"$f":"Jegyzőkönyv!H42","v":""},{"$f":"Jegyzőkönyv!K42","v":""},{"$f":"Jegyzőkönyv!N42","v":""},{"$f":"Jegyzőkönyv!Q42","v":""},{"$f":"Jegyzőkönyv!T42","v":""},{"$f":"Jegyzőkönyv!W42","v":""},{"$f":"Jegyzőkönyv!Z42","v":""},{"$f":"Jegyzőkönyv!AC42","v":""},{"$f":"Jegyzőkönyv!AF42","v":""}]
["9.",{"$f":"Jegyzőkönyv!E47","v":""},{"$f":"Jegyzőkönyv!H47","v":""},{"$f":"Jegyzőkönyv!K47","v":""},{"$f":"Jegyzőkönyv!N47","v":""},{"$f":"Jegyzőkönyv!Q47","v":""},{"$f":"Jegyzőkönyv!T47","v":""},{"$f":"Jegyzőkönyv!W47","v":""},{"$f":"Jegyzőkönyv!Z47","v":""},{"$f":"Jegyzőkönyv!AC47","v":""},{"$f":"Jegyzőkönyv!AF47","v":""}]
["10.",{"$f":"Jegyzőkönyv!E52","v":""},{"$f":"Jegyzőkönyv!H52","v":""},{"$f":"Jegyzőkönyv!K52","v":""},{"$f":"Jegyzőkönyv!N52","v":""},{"$f":"Jegyzőkönyv!Q52","v":""},{"$f":"Jegyzőkönyv!T52","v":""},{"$f":"Jegyzőkönyv!W52","v":""},{"$f":"Jegyzőkönyv!Z52","v":""},{"$f":"Jegyzőkönyv!AC52","v":""},{"$f":"Jegyzőkönyv!AF52","v":""}]
["11.",{"$f":"Jegyzőkönyv!E57","v":""},{"$f":"Jegyzőkönyv!H57","v":""},{"$f":"Jegyzőkönyv!K57","v":""},{"$f":"Jegyzőkönyv!N57","v":""},{"$f":"Jegyzőkönyv!Q57","v":""},{"$f":"Jegyzőkönyv!T57","v":""},{"$f":"Jegyzőkönyv!W57","v":""},{"$f":"Jegyzőkönyv!Z57","v":""},{"$f":"Jegyzőkönyv!AC57","v":""},{"$f":"Jegyzőkönyv!AF57","v":""}]
["12.",{"$f":"Jegyzőkönyv!E62","v":""},{"$f":"Jegyzőkönyv!H62","v":""},{"$f":"Jegyzőkönyv!K62","v":""},{"$f":"Jegyzőkönyv!N62","v":""},{"$f":"Jegyzőkönyv!Q62","v":""},{"$f":"Jegyzőkönyv!T62","v":""},{"$f":"Jegyzőkönyv!W62","v":""},{"$f":"Jegyzőkönyv!Z62","v":""},{"$f":"Jegyzőkönyv!AC62","v":""},{"$f":"Jegyzőkönyv!AF62","v":""}]
[]
[]
[]
["időeredmények"]
[null,"1.","2.","3.","4.","5.","6.","7.","8.","9.","10."]
["1.",{"$f":"Jegyzőkönyv!D3","v":1.5106481481481481E-3},{"$f":"Jegyzőkönyv!G3","v":8.4618055555555542E-4},{"$f":"Jegyzőkönyv!J3","v":1.7760416666666669E-3},{"$f":"Jegyzőkönyv!M3","v":2.5472222222222224E-3},{"$f":"Jegyzőkönyv!P3","v":2.6157407407407412E-4},{"$f":"Jegyzőkönyv!S3","v":1.1550925925925925E-3},{"$f":"Jegyzőkönyv!V3","v":1.7072916666666666E-3},{"$f":"Jegyzőkönyv!Y3","v":1.2623842592592591E-3},{"$f":"Jegyzőkönyv!AB3","v":1.5761574074074074E-3},{"$f":"Jegyzőkönyv!AE3","v":2}]
["2.",{"$f":"Jegyzőkönyv!D8","v":1.504976851851852E-3},{"$f":"Jegyzőkönyv!G8","v":8.2685185185185173E-4},{"$f":"Jegyzőkönyv!J8","v":1.7271990740740739E-3},{"$f":"Jegyzőkönyv!M8","v":2.741087962962963E-3},{"$f":"Jegyzőkönyv!P8","v":2.380787037037037E-4},{"$f":"Jegyzőkönyv!S8","v":1.1445601851851851E-3},{"$f":"Jegyzőkönyv!V8","v":1.6925925925925925E-3},{"$f":"Jegyzőkönyv!Y8","v":1.1128472222222223E-3},{"$f":"Jegyzőkönyv!AB8","v":1.5502314814814816E-3},{"$f":"Jegyzőkönyv!AE8","v":1}]
["3.",{"$f":"Jegyzőkönyv!D13","v":1.5150462962962962E-3},{"$f":"Jegyzőkönyv!G13","v":7.2083333333333331E-4},{"$f":"Jegyzőkönyv!J13","v":1.6755787037037036E-3},{"$f":"Jegyzőkönyv!M13","v":2.4041666666666664E-3},{"$f":"Jegyzőkönyv!P13","v":2.6180555555555554E-4},{"$f":"Jegyzőkönyv!S13","v":1.0603009259259259E-3},{"$f":"Jegyzőkönyv!V13","v":1.7010416666666667E-3},{"$f":"Jegyzőkönyv!Y13","v":1.2190972222222223E-3},{"$f":"Jegyzőkönyv!AB13","v":1.5543981481481483E-3},{"$f":"Jegyzőkönyv!AE13","v":5}]
["4.",{"$f":"Jegyzőkönyv!D18","v":1.4608796296296297E-3},{"$f":"Jegyzőkönyv!G18","v":7.6307870370370375E-4},{"$f":"Jegyzőkönyv!J18","v":1.6155092592592592E-3},{"$f":"Jegyzőkönyv!M18","v":2.4932870370370373E-3},{"$f":"Jegyzőkönyv!P18","v":2.4710648148148145E-4},{"$f":"Jegyzőkönyv!S18","v":1.077199074074074E-3},{"$f":"Jegyzőkönyv!V18","v":1.7283564814814815E-3},{"$f":"Jegyzőkönyv!Y18","v":1.1409722222222223E-3},{"$f":"Jegyzőkönyv!AB18","v":1.5125E-3},{"$f":"Jegyzőkönyv!AE18","v":4}]
["5.",{"$f":"Jegyzőkönyv!D23","v":1.4829861111111111E-3},{"$f":"Jegyzőkönyv!G23","v":7.3483796296296307E-4},{"$f":"Jegyzőkönyv!J23","v":1.6016203703703704E-3},{"$f":"Jegyzőkönyv!M23","v":2.3798611111111112E-3},{"$f":"Jegyzőkönyv!P23","v":2.5416666666666665E-4},{"$f":"Jegyzőkönyv!S23","v":1.0630787037037037E-3},{"$f":"Jegyzőkönyv!V23","v":1.7636574074074074E-3},{"$f":"Jegyzőkönyv!Y23","v":1.0819444444444442E-3},{"$f":"Jegyzőkönyv!AB23","v":1.525810185185185E-3},{"$f":"Jegyzőkönyv!AE23","v":3}]
["6.",{"$f":"Jegyzőkönyv!D28","v":0},{"$f":"Jegyzőkönyv!G28","v":0},{"$f":"Jegyzőkönyv!J28","v":0},{"$f":"Jegyzőkönyv!M28","v":0},{"$f":"Jegyzőkönyv!P28","v":0},{"$f":"Jegyzőkönyv!S28","v":0},{"$f":"Jegyzőkönyv!V28","v":0},{"$f":"Jegyzőkönyv!Y28","v":0},{"$f":"Jegyzőkönyv!AB28","v":0},{"$f":"Jegyzőkönyv!AE28","v":0}]
["7.",{"$f":"Jegyzőkönyv!D33","v":0},{"$f":"Jegyzőkönyv!G33","v":0},{"$f":"Jegyzőkönyv!J33","v":0},{"$f":"Jegyzőkönyv!M33","v":0},{"$f":"Jegyzőkönyv!P33","v":0},{"$f":"Jegyzőkönyv!S33","v":0},{"$f":"Jegyzőkönyv!V33","v":0},{"$f":"Jegyzőkönyv!Y33","v":0},{"$f":"Jegyzőkönyv!AB33","v":0},{"$f":"Jegyzőkönyv!AE33","v":0}]
["8.",{"$f":"Jegyzőkönyv!D38","v":0},{"$f":"Jegyzőkönyv!G38","v":0},{"$f":"Jegyzőkönyv!J38","v":0},{"$f":"Jegyzőkönyv!M38","v":0},{"$f":"Jegyzőkönyv!P38","v":0},{"$f":"Jegyzőkönyv!S38","v":0},{"$f":"Jegyzőkönyv!V38","v":0},{"$f":"Jegyzőkönyv!Y38","v":0},{"$f":"Jegyzőkönyv!AB38","v":0},{"$f":"Jegyzőkönyv!AE38","v":0}]
["9.",{"$f":"Jegyzőkönyv!D43","v":0},{"$f":"Jegyzőkönyv!G43","v":0},{"$f":"Jegyzőkönyv!J43","v":0},{"$f":"Jegyzőkönyv!M43","v":0},{"$f":"Jegyzőkönyv!P43","v":0},{"$f":"Jegyzőkönyv!S43","v":0},{"$f":"Jegyzőkönyv!V43","v":0},{"$f":"Jegyzőkönyv!Y43","v":0},{"$f":"Jegyzőkönyv!AB43","v":0},{"$f":"Jegyzőkönyv!AE43","v":0}]
["10.",{"$f":"Jegyzőkönyv!D48","v":0},{"$f":"Jegyzőkönyv!G48","v":0},{"$f":"Jegyzőkönyv!J48","v":0},{"$f":"Jegyzőkönyv!M48","v":0},{"$f":"Jegyzőkönyv!P48","v":"00:00:00"},{"$f":"Jegyzőkönyv!S48","v":0},{"$f":"Jegyzőkönyv!V48","v":0},{"$f":"Jegyzőkönyv!Y48","v":0},{"$f":"Jegyzőkönyv!AB48","v":0},{"$f":"Jegyzőkönyv!AE48","v":0}]
["11.",{"$f":"Jegyzőkönyv!D53","v":0},{"$f":"Jegyzőkönyv!G53","v":0},{"$f":"Jegyzőkönyv!J53","v":0},{"$f":"Jegyzőkönyv!M53","v":0},{"$f":"Jegyzőkönyv!P53","v":"00:00:00"},{"$f":"Jegyzőkönyv!S53","v":0},{"$f":"Jegyzőkönyv!V53","v":0},{"$f":"Jegyzőkönyv!Y53","v":0},{"$f":"Jegyzőkönyv!AB53","v":0},{"$f":"Jegyzőkönyv!AE53","v":0}]
["12.",{"$f":"Jegyzőkönyv!D58","v":0},{"$f":"Jegyzőkönyv!G48","v":0},{"$f":"Jegyzőkönyv!J48","v":0},{"$f":"Jegyzőkönyv!M48","v":0},{"$f":"Jegyzőkönyv!P48","v":"00:00:00"},{"$f":"Jegyzőkönyv!S48","v":0},{"$f":"Jegyzőkönyv!V48","v":0},{"$f":"Jegyzőkönyv!Y48","v":0},{"$f":"Jegyzőkönyv!AB48","v":0},{"$f":"Jegyzőkönyv!AE48","v":0}]
[]
[]
[]
[]
[]
[]
[]
["hibák"]
[null,"1.","2.","3.","4.","5.","6.","7.","8.","9.","10."]
["1.",{"$f":"Jegyzőkönyv!D4","v":0},{"$f":"Jegyzőkönyv!G4","v":0},{"$f":"Jegyzőkönyv!J4","v":0},{"$f":"Jegyzőkönyv!M4","v":0},{"$f":"Jegyzőkönyv!P4","v":0},{"$f":"Jegyzőkönyv!S4","v":5.7870370370370366E-5},{"$f":"Jegyzőkönyv!V4","v":5.7870370370370366E-5},{"$f":"Jegyzőkönyv!Y4","v":0},{"$f":"Jegyzőkönyv!AB4","v":0},{"$f":"Jegyzőkönyv!AE4","v":0}]
["2.",{"$f":"Jegyzőkönyv!D9","v":1.1574074074074073E-5},{"$f":"Jegyzőkönyv!G9","v":1.1574074074074073E-5},{"$f":"Jegyzőkönyv!J9","v":0},{"$f":"Jegyzőkönyv!M9","v":0},{"$f":"Jegyzőkönyv!P9","v":0},{"$f":"Jegyzőkönyv!S9","v":0},{"$f":"Jegyzőkönyv!V9","v":5.7870370370370366E-5},{"$f":"Jegyzőkönyv!Y9","v":5.7870370370370366E-5},{"$f":"Jegyzőkönyv!AB9","v":1.1574074074074073E-5},{"$f":"Jegyzőkönyv!AE9","v":0}]
["3.",{"$f":"Jegyzőkönyv!D14","v":0},{"$f":"Jegyzőkönyv!G14","v":0},{"$f":"Jegyzőkönyv!J14","v":0},{"$f":"Jegyzőkönyv!M14","v":0},{"$f":"Jegyzőkönyv!P14","v":0},{"$f":"Jegyzőkönyv!S14","v":4.6296296296296294E-5},{"$f":"Jegyzőkönyv!V14","v":1.7361111111111112E-4},{"$f":"Jegyzőkönyv!Y14","v":2.3148148148148147E-5},{"$f":"Jegyzőkönyv!AB14","v":0},{"$f":"Jegyzőkönyv!AE14","v":0}]
["4.",{"$f":"Jegyzőkönyv!D19","v":1.1574074074074073E-5},{"$f":"Jegyzőkönyv!G19","v":1.1574074074074073E-5},{"$f":"Jegyzőkönyv!J19","v":0},{"$f":"Jegyzőkönyv!M19","v":2.3148148148148147E-5},{"$f":"Jegyzőkönyv!P19","v":0},{"$f":"Jegyzőkönyv!S19","v":0},{"$f":"Jegyzőkönyv!V19","v":0},{"$f":"Jegyzőkönyv!Y19","v":0},{"$f":"Jegyzőkönyv!AB19","v":2.3148148148148147E-5},{"$f":"Jegyzőkönyv!AE19","v":0}]
["5.",{"$f":"Jegyzőkönyv!D24","v":0},{"$f":"Jegyzőkönyv!G24","v":0},{"$f":"Jegyzőkönyv!J24","v":0},{"$f":"Jegyzőkönyv!M24","v":4.6296296296296294E-5},{"$f":"Jegyzőkönyv!P24","v":0},{"$f":"Jegyzőkönyv!S24","v":0},{"$f":"Jegyzőkönyv!V24","v":0},{"$f":"Jegyzőkönyv!Y24","v":2.3148148148148147E-5},{"$f":"Jegyzőkönyv!AB24","v":0},{"$f":"Jegyzőkönyv!AE24","v":0}]
["6.",{"$f":"Jegyzőkönyv!D29","v":0},{"$f":"Jegyzőkönyv!G29","v":0},{"$f":"Jegyzőkönyv!J29","v":0},{"$f":"Jegyzőkönyv!M29","v":0},{"$f":"Jegyzőkönyv!P29","v":0},{"$f":"Jegyzőkönyv!S29","v":0},{"$f":"Jegyzőkönyv!V29","v":0},{"$f":"Jegyzőkönyv!Y29","v":0},{"$f":"Jegyzőkönyv!AB29","v":0},{"$f":"Jegyzőkönyv!AE29","v":0}]
["7.",{"$f":"Jegyzőkönyv!D34","v":0},{"$f":"Jegyzőkönyv!G34","v":0},{"$f":"Jegyzőkönyv!J34","v":0},{"$f":"Jegyzőkönyv!M34","v":0},{"$f":"Jegyzőkönyv!P34","v":0},{"$f":"Jegyzőkönyv!S34","v":0},{"$f":"Jegyzőkönyv!V34","v":0},{"$f":"Jegyzőkönyv!Y34","v":0},{"$f":"Jegyzőkönyv!AB34","v":0},{"$f":"Jegyzőkönyv!AE34","v":0}]
["8.",{"$f":"Jegyzőkönyv!D39","v":0},{"$f":"Jegyzőkönyv!G39","v":0},{"$f":"Jegyzőkönyv!J39","v":0},{"$f":"Jegyzőkönyv!M39","v":0},{"$f":"Jegyzőkönyv!P39","v":0},{"$f":"Jegyzőkönyv!S39","v":0},{"$f":"Jegyzőkönyv!V39","v":0},{"$f":"Jegyzőkönyv!Y39","v":0},{"$f":"Jegyzőkönyv!AB39","v":0},{"$f":"Jegyzőkönyv!AE39","v":0}]
["9.",{"$f":"Jegyzőkönyv!D44","v":0},{"$f":"Jegyzőkönyv!G44","v":0},{"$f":"Jegyzőkönyv!J44","v":0},{"$f":"Jegyzőkönyv!M44","v":0},{"$f":"Jegyzőkönyv!P44","v":0},{"$f":"Jegyzőkönyv!S44","v":0},{"$f":"Jegyzőkönyv!V44","v":0},{"$f":"Jegyzőkönyv!Y44","v":0},{"$f":"Jegyzőkönyv!AB44","v":0},{"$f":"Jegyzőkönyv!AE44","v":0}]
["10.",{"$f":"Jegyzőkönyv!D49","v":0},{"$f":"Jegyzőkönyv!G49","v":0},{"$f":"Jegyzőkönyv!J49","v":0},{"$f":"Jegyzőkönyv!M49","v":0},{"$f":"Jegyzőkönyv!P49","v":0},{"$f":"Jegyzőkönyv!S49","v":0},{"$f":"Jegyzőkönyv!V49","v":0},{"$f":"Jegyzőkönyv!Y49","v":0},{"$f":"Jegyzőkönyv!AB49","v":0},{"$f":"Jegyzőkönyv!AE49","v":0}]
["11.",{"$f":"Jegyzőkönyv!D54","v":0},{"$f":"Jegyzőkönyv!G54","v":0},{"$f":"Jegyzőkönyv!J54","v":0},{"$f":"Jegyzőkönyv!M54","v":0},{"$f":"Jegyzőkönyv!P54","v":0},{"$f":"Jegyzőkönyv!S54","v":0},{"$f":"Jegyzőkönyv!V54","v":0},{"$f":"Jegyzőkönyv!Y54","v":0},{"$f":"Jegyzőkönyv!AB54","v":0},{"$f":"Jegyzőkönyv!AE54","v":0}]
["12.",{"$f":"Jegyzőkönyv!D59","v":0},{"$f":"Jegyzőkönyv!G59","v":0},{"$f":"Jegyzőkönyv!J59","v":0},{"$f":"Jegyzőkönyv!M59","v":0},{"$f":"Jegyzőkönyv!P59","v":0},{"$f":"Jegyzőkönyv!S59","v":0},{"$f":"Jegyzőkönyv!V59","v":0},{"$f":"Jegyzőkönyv!Y59","v":0},{"$f":"Jegyzőkönyv!AB59","v":0},{"$f":"Jegyzőkönyv!AE59","v":0}]
[]
[]
[]
[]
["pont"]
[null,"1.","2.","3.","4.","5.","6.","7.","8.","9.","10."]
["1.",{"$f":"Jegyzőkönyv!D7","v":3},{"$f":"Jegyzőkönyv!G7","v":1},{"$f":"Jegyzőkönyv!J7","v":1},{"$f":"Jegyzőkönyv!M7","v":2},{"$f":"Jegyzőkönyv!P7","v":2},{"$f":"Jegyzőkönyv!S7","v":1},{"$f":"Jegyzőkönyv!V7","v":2},{"$f":"Jegyzőkönyv!Y7","v":1},{"$f":"Jegyzőkönyv!AB7","v":1},{"$f":"Jegyzőkönyv!AE7","v":4}]
["2.",{"$f":"Jegyzőkönyv!D12","v":1},{"$f":"Jegyzőkönyv!G12","v":2},{"$f":"Jegyzőkönyv!J12","v":2},{"$f":"Jegyzőkönyv!M12","v":1},{"$f":"Jegyzőkönyv!P12","v":5},{"$f":"Jegyzőkönyv!S12","v":2},{"$f":"Jegyzőkönyv!V12","v":4},{"$f":"Jegyzőkönyv!Y12","v":3},{"$f":"Jegyzőkönyv!AB12","v":2},{"$f":"Jegyzőkönyv!AE12","v":5}]
["3.",{"$f":"Jegyzőkönyv!D17","v":2},{"$f":"Jegyzőkönyv!G17","v":5},{"$f":"Jegyzőkönyv!J17","v":3},{"$f":"Jegyzőkönyv!M17","v":5},{"$f":"Jegyzőkönyv!P17","v":1},{"$f":"Jegyzőkönyv!S17","v":3},{"$f":"Jegyzőkönyv!V17","v":1},{"$f":"Jegyzőkönyv!Y17","v":2},{"$f":"Jegyzőkönyv!AB17","v":3},{"$f":"Jegyzőkönyv!AE17","v":1}]
["4.",{"$f":"Jegyzőkönyv!D22","v":5},{"$f":"Jegyzőkönyv!G22","v":3},{"$f":"Jegyzőkönyv!J22","v":4},{"$f":"Jegyzőkönyv!M22","v":3},{"$f":"Jegyzőkönyv!P22","v":4},{"$f":"Jegyzőkönyv!S22","v":4},{"$f":"Jegyzőkönyv!V22","v":5},{"$f":"Jegyzőkönyv!Y22","v":4},{"$f":"Jegyzőkönyv!AB22","v":4},{"$f":"Jegyzőkönyv!AE22","v":2}]
["5.",{"$f":"Jegyzőkönyv!D27","v":4},{"$f":"Jegyzőkönyv!G27","v":4},{"$f":"Jegyzőkönyv!J27","v":5},{"$f":"Jegyzőkönyv!M27","v":4},{"$f":"Jegyzőkönyv!P27","v":3},{"$f":"Jegyzőkönyv!S27","v":5},{"$f":"Jegyzőkönyv!V27","v":3},{"$f":"Jegyzőkönyv!Y27","v":5},{"$f":"Jegyzőkönyv!AB27","v":5},{"$f":"Jegyzőkönyv!AE27","v":3}]
["6.",{"$f":"Jegyzőkönyv!D32","v":""},{"$f":"Jegyzőkönyv!G32","v":""},{"$f":"Jegyzőkönyv!J32","v":""},{"$f":"Jegyzőkönyv!M32","v":""},{"$f":"Jegyzőkönyv!P32","v":""},{"$f":"Jegyzőkönyv!S32","v":""},{"$f":"Jegyzőkönyv!V32","v":""},{"$f":"Jegyzőkönyv!Y32","v":""},{"$f":"Jegyzőkönyv!AB32","v":""},{"$f":"Jegyzőkönyv!AE32","v":""}]
["7.",{"$f":"Jegyzőkönyv!D37","v":""},{"$f":"Jegyzőkönyv!G37","v":""},{"$f":"Jegyzőkönyv!J37","v":""},{"$f":"Jegyzőkönyv!M37","v":""},{"$f":"Jegyzőkönyv!P37","v":""},{"$f":"Jegyzőkönyv!S37","v":""},{"$f":"Jegyzőkönyv!V37","v":""},{"$f":"Jegyzőkönyv!Y37","v":""},{"$f":"Jegyzőkönyv!AB37","v":""},{"$f":"Jegyzőkönyv!AE37","v":""}]
["8.",{"$f":"Jegyzőkönyv!D42","v":""},{"$f":"Jegyzőkönyv!G42","v":""},{"$f":"Jegyzőkönyv!J42","v":""},{"$f":"Jegyzőkönyv!M42","v":""},{"$f":"Jegyzőkönyv!P42","v":""},{"$f":"Jegyzőkönyv!S42","v":""},{"$f":"Jegyzőkönyv!V42","v":""},{"$f":"Jegyzőkönyv!Y42","v":""},{"$f":"Jegyzőkönyv!AB42","v":""},{"$f":"Jegyzőkönyv!AE42","v":""}]
["9.",{"$f":"Jegyzőkönyv!D47","v":""},{"$f":"Jegyzőkönyv!G47","v":""},{"$f":"Jegyzőkönyv!J47","v":""},{"$f":"Jegyzőkönyv!M47","v":""},{"$f":"Jegyzőkönyv!P47","v":""},{"$f":"Jegyzőkönyv!S47","v":""},{"$f":"Jegyzőkönyv!V47","v":""},{"$f":"Jegyzőkönyv!Y47","v":""},{"$f":"Jegyzőkönyv!AB47","v":""},{"$f":"Jegyzőkönyv!AE47","v":""}]
["10.",{"$f":"Jegyzőkönyv!D52","v":""},{"$f":"Jegyzőkönyv!G52","v":""},{"$f":"Jegyzőkönyv!J52","v":""},{"$f":"Jegyzőkönyv!M52","v":""},{"$f":"Jegyzőkönyv!P52","v":""},{"$f":"Jegyzőkönyv!S52","v":""},{"$f":"Jegyzőkönyv!V52","v":""},{"$f":"Jegyzőkönyv!Y52","v":""},{"$f":"Jegyzőkönyv!AB52","v":""},{"$f":"Jegyzőkönyv!AE52","v":""}]
["11.",{"$f":"Jegyzőkönyv!D57","v":""},{"$f":"Jegyzőkönyv!G57","v":""},{"$f":"Jegyzőkönyv!J57","v":""},{"$f":"Jegyzőkönyv!M57","v":""},{"$f":"Jegyzőkönyv!P57","v":""},{"$f":"Jegyzőkönyv!S57","v":""},{"$f":"Jegyzőkönyv!V57","v":""},{"$f":"Jegyzőkönyv!Y57","v":""},{"$f":"Jegyzőkönyv!AB57","v":""},{"$f":"Jegyzőkönyv!AE57","v":""}]
["12.",{"$f":"Jegyzőkönyv!D62","v":""},{"$f":"Jegyzőkönyv!G62","v":""},{"$f":"Jegyzőkönyv!J62","v":""},{"$f":"Jegyzőkönyv!M62","v":""},{"$f":"Jegyzőkönyv!P62","v":""},{"$f":"Jegyzőkönyv!S62","v":""},{"$f":"Jegyzőkönyv!V62","v":""},{"$f":"Jegyzőkönyv!Y62","v":""},{"$f":"Jegyzőkönyv!AB62","v":""},{"$f":"Jegyzőkönyv!AE62","v":""}]
[]
[]
[]
["idő/pont"]
[null,"1.","2.","3.","4.","5.","6.","7.","8.","9.","10."]
[null,{"$f":"Jegyzőkönyv!D45","v":0},{"$f":"Jegyzőkönyv!G45","v":0},{"$f":"Jegyzőkönyv!J45","v":0},{"$f":"Jegyzőkönyv!M45","v":0},{"$f":"Jegyzőkönyv!P45","v":0},{"$f":"Jegyzőkönyv!S45","v":0},{"$f":"Jegyzőkönyv!V45","v":0},{"$f":"Jegyzőkönyv!Y45","v":0},{"$f":"Jegyzőkönyv!AB45","v":0},{"$f":"Jegyzőkönyv!AE45","v":0}]

{"sheet":"Végeredmény","index":3,"n_rows":13,"n_cols":8,"rows_kept":13,"cut":false,"hidden":false,"merged":[]}
["Helyezés","Iskola","Pontszám",null,null,{"$f":"Jegyzőkönyv!AG3","v":18},{"$f":"Jegyzőkönyv!AH3","v":5},{"$f":"Jegyzőkönyv!B3","v":"Pécs"}]
[{"$f":"IF(H1=\"\",\"\",\"I.\")","v":"I."},{"$f":"IF(F1=\"\",\"\",INDEX($H$1:$H$12,MATCH(C2,$F$1:$F$12,0)))","v":"Szombathely"},{"$f":"IF(F1=\"\",\"\",LARGE($F$1:$F$12,D2))","v":41},1,null,{"$f":"Jegyzőkönyv!AG8","v":27},{"$f":"Jegyzőkönyv!AH8","v":3},{"$f":"Jegyzőkönyv!B8","v":"Békés"}]
[{"$f":"IF(H2=\"\",\"\",\"II.\")","v":"II."},"Törökbálint",38,2,null,{"$f":"Jegyzőkönyv!AG13","v":26},{"$f":"Jegyzőkönyv!AH13","v":4},{"$f":"Jegyzőkönyv!B13","v":"Hajdúböszörmény"}]
[{"$f":"IF(H3=\"\",\"\",\"III.\")","v":"III."},"Békés",27,3,null,{"$f":"Jegyzőkönyv!AG18","v":38},{"$f":"Jegyzőkönyv!AH18","v":2},{"$f":"Jegyzőkönyv!B18","v":"Törökbálint"}]
[{"$f":"IF(H4=\"\",\"\",\"IV.\")","v":"IV."},"Hajdúböszörmény",26,4,null,{"$f":"Jegyzőkönyv!AG23","v":41},{"$f":"Jegyzőkönyv!AH23","v":1},{"$f":"Jegyzőkönyv!B23","v":"Szombathely"}]
[{"$f":"IF(H5=\"\",\"\",\"V.\")","v":"V."},"Pécs",18,5,null,{"$f":"Jegyzőkönyv!AG28","v":""},{"$f":"Jegyzőkönyv!AH28","v":""},{"$f":"Jegyzőkönyv!B28","v":0}]
[{"$f":"IF(H6=\"\",\"\",\"VI.\")","v":"VI."},"","",6,null,{"$f":"Jegyzőkönyv!AG33","v":""},{"$f":"Jegyzőkönyv!AH33","v":""},{"$f":"Jegyzőkönyv!B33","v":0}]
[{"$f":"IF(H7=\"\",\"\",\"VII.\")","v":"VII."},"","",7,null,{"$f":"Jegyzőkönyv!AG38","v":""},{"$f":"Jegyzőkönyv!AH38","v":""},{"$f":"Jegyzőkönyv!B38","v":0}]
[{"$f":"IF(H8=\"\",\"\",\"VIII.\")","v":"VIII."},"","",8,null,{"$f":"Jegyzőkönyv!AG43","v":""},{"$f":"Jegyzőkönyv!AH43","v":""},{"$f":"Jegyzőkönyv!B43","v":0}]
[{"$f":"IF(H9=\"\",\"\",\"IX.\")","v":"IX."},"","",9,null,{"$f":"Jegyzőkönyv!AG48","v":""},{"$f":"Jegyzőkönyv!AH48","v":""},{"$f":"Jegyzőkönyv!B48","v":0}]
[{"$f":"IF(H10=\"\",\"\",\"X.\")","v":"X."},"","",10,null,{"$f":"Jegyzőkönyv!AG53","v":""},{"$f":"Jegyzőkönyv!AH53","v":""},{"$f":"Jegyzőkönyv!B53","v":0}]
[{"$f":"IF(H11=\"\",\"\",\"XI.\")","v":"XI."},"","",11,null,{"$f":"Jegyzőkönyv!AG58","v":""},{"$f":"Jegyzőkönyv!AH58","v":""},{"$f":"Jegyzőkönyv!B58","v":0}]
[{"$f":"IF(H12=\"\",\"\",\"XII.\")","v":"XII."},"","",12]

{"sheet":"Kivetítő","index":4,"n_rows":15,"n_cols":24,"rows_kept":15,"cut":false,"hidden":false,"merged":[[0,0,0,23],[1,22,1,23],[1,10,1,11],[1,12,1,13],[1,14,1,15],[1,16,1,17],[1,18,1,19],[1,20,1,21],[1,0,2,0],[1,1,2,1],[1,2,1,3],[1,4,1,5],[1,6,1,7],[1,8,1,9]]}
[{"$f":"IF(Versenyszámok!B13=\"\",\"\",Versenyszámok!B13)","v":""}]
["Ssz.","Csapat",{"$f":"Jegyzőkönyv!D2","v":"1. Futás váltóbottal"},null,{"$f":"Jegyzőkönyv!G2","v":"2. Négykézlábjárás"},null,{"$f":"Jegyzőkönyv!J2","v":"3. Alagúton át"},null,{"$f":"Jegyzőkönyv!M2","v":"4. Labdás ügyességi váltó"},null,{"$f":"Jegyzőkönyv!P2","v":"5. Hídakadály"},null,{"$f":"Jegyzőkönyv!S2","v":"6. Bújj és karikában fuss"},null,{"$f":"Jegyzőkönyv!V2","v":"7. Karikarakó"},null,{"$f":"Jegyzőkönyv!Y2","v":"8. Szlalom kézilabda"},null,{"$f":"Jegyzőkönyv!AB2","v":"9. Karikán az akadályra"},null,{"$f":"Jegyzőkönyv!AE2","v":"10. Bombázó"},null,"Összessített"]
[null,null,"Pontszám","Helyezés","Pontszám","Helyezés","Pontszám","Helyezés","Pontszám","Helyezés","Pontszám","Helyezés","Pontszám","Helyezés","Pontszám","Helyezés","Pontszám","Helyezés","Pontszám","Helyezés","Pontszám","Helyezés","Pontszám","Helyezés"]
[1,{"$f":"IF(ISBLANK(Jegyzőkönyv!B3),\"\",Jegyzőkönyv!B3)","v":"Pécs"},{"$f":"Jegyzőkönyv!D7","v":3},{"$f":"Jegyzőkönyv!D6","v":3},{"$f":"Jegyzőkönyv!G7","v":1},{"$f":"Jegyzőkönyv!G6","v":5},{"$f":"Jegyzőkönyv!J7","v":1},{"$f":"Jegyzőkönyv!J6","v":5},{"$f":"Jegyzőkönyv!M7","v":2},{"$f":"Jegyzőkönyv!M6","v":4},{"$f":"Jegyzőkönyv!P7","v":2},{"$f":"Jegyzőkönyv!P6","v":4},{"$f":"Jegyzőkönyv!S7","v":1},{"$f":"Jegyzőkönyv!S6","v":5},{"$f":"Jegyzőkönyv!V7","v":2},{"$f":"Jegyzőkönyv!V6","v":4},{"$f":"Jegyzőkönyv!Y7","v":1},{"$f":"Jegyzőkönyv!Y6","v":5},{"$f":"Jegyzőkönyv!AB7","v":1},{"$f":"Jegyzőkönyv!AB6","v":5},{"$f":"Jegyzőkönyv!AE7","v":4},{"$f":"Jegyzőkönyv!AE6","v":2},{"$f":"Jegyzőkönyv!AG3","v":18},{"$f":"Jegyzőkönyv!AH3","v":5}]
[2,{"$f":"IF(ISBLANK(Jegyzőkönyv!B8),\"\",Jegyzőkönyv!B8)","v":"Békés"},{"$f":"Jegyzőkönyv!D12","v":1},{"$f":"Jegyzőkönyv!D11","v":5},{"$f":"Jegyzőkönyv!G12","v":2},{"$f":"Jegyzőkönyv!G11","v":4},{"$f":"Jegyzőkönyv!J12","v":2},{"$f":"Jegyzőkönyv!J11","v":4},{"$f":"Jegyzőkönyv!M12","v":1},{"$f":"Jegyzőkönyv!M11","v":5},{"$f":"Jegyzőkönyv!P12","v":5},{"$f":"Jegyzőkönyv!P11","v":1},{"$f":"Jegyzőkönyv!S12","v":2},{"$f":"Jegyzőkönyv!S11","v":4},{"$f":"Jegyzőkönyv!V12","v":4},{"$f":"Jegyzőkönyv!V11","v":2},{"$f":"Jegyzőkönyv!Y12","v":3},{"$f":"Jegyzőkönyv!Y11","v":3},{"$f":"Jegyzőkönyv!AB12","v":2},{"$f":"Jegyzőkönyv!AB11","v":4},{"$f":"Jegyzőkönyv!AE12","v":5},{"$f":"Jegyzőkönyv!AE11","v":1},{"$f":"Jegyzőkönyv!AG8","v":27},{"$f":"Jegyzőkönyv!AH8","v":3}]
[3,{"$f":"IF(ISBLANK(Jegyzőkönyv!B13),\"\",Jegyzőkönyv!B13)","v":"Hajdúböszörmény"},{"$f":"Jegyzőkönyv!D17","v":2},{"$f":"Jegyzőkönyv!D16","v":4},{"$f":"Jegyzőkönyv!G17","v":5},{"$f":"Jegyzőkönyv!G16","v":1},{"$f":"Jegyzőkönyv!J17","v":3},{"$f":"Jegyzőkönyv!J16","v":3},{"$f":"Jegyzőkönyv!M17","v":5},{"$f":"Jegyzőkönyv!M16","v":1},{"$f":"Jegyzőkönyv!P17","v":1},{"$f":"Jegyzőkönyv!P16","v":5},{"$f":"Jegyzőkönyv!S17","v":3},{"$f":"Jegyzőkönyv!S16","v":3},{"$f":"Jegyzőkönyv!V17","v":1},{"$f":"Jegyzőkönyv!V16","v":5},{"$f":"Jegyzőkönyv!Y17","v":2},{"$f":"Jegyzőkönyv!Y16","v":4},{"$f":"Jegyzőkönyv!AB17","v":3},{"$f":"Jegyzőkönyv!AB16","v":3},{"$f":"Jegyzőkönyv!AE17","v":1},{"$f":"Jegyzőkönyv!AE16","v":5},{"$f":"Jegyzőkönyv!AG13","v":26},{"$f":"Jegyzőkönyv!AH13","v":4}]
[4,{"$f":"IF(ISBLANK(Jegyzőkönyv!B18),\"\",Jegyzőkönyv!B18)","v":"Törökbálint"},{"$f":"Jegyzőkönyv!D22","v":5},{"$f":"Jegyzőkönyv!D21","v":1},{"$f":"Jegyzőkönyv!G22","v":3},{"$f":"Jegyzőkönyv!G21","v":3},{"$f":"Jegyzőkönyv!J22","v":4},{"$f":"Jegyzőkönyv!J21","v":2},{"$f":"Jegyzőkönyv!M22","v":3},{"$f":"Jegyzőkönyv!M21","v":3},{"$f":"Jegyzőkönyv!P22","v":4},{"$f":"Jegyzőkönyv!P21","v":2},{"$f":"Jegyzőkönyv!S22","v":4},{"$f":"Jegyzőkönyv!S21","v":2},{"$f":"Jegyzőkönyv!V22","v":5},{"$f":"Jegyzőkönyv!V21","v":1},{"$f":"Jegyzőkönyv!Y22","v":4},{"$f":"Jegyzőkönyv!Y21","v":2},{"$f":"Jegyzőkönyv!AB22","v":4},{"$f":"Jegyzőkönyv!AB21","v":2},{"$f":"Jegyzőkönyv!AE22","v":2},{"$f":"Jegyzőkönyv!AE21","v":4},{"$f":"Jegyzőkönyv!AG18","v":38},{"$f":"Jegyzőkönyv!AH18","v":2}]
[5,{"$f":"IF(ISBLANK(Jegyzőkönyv!B23),\"\",Jegyzőkönyv!B23)","v":"Szombathely"},{"$f":"Jegyzőkönyv!D27","v":4},{"$f":"Jegyzőkönyv!D26","v":2},{"$f":"Jegyzőkönyv!G27","v":4},{"$f":"Jegyzőkönyv!G26","v":2},{"$f":"Jegyzőkönyv!J27","v":5},{"$f":"Jegyzőkönyv!J26","v":1},{"$f":"Jegyzőkönyv!M27","v":4},{"$f":"Jegyzőkönyv!M26","v":2},{"$f":"Jegyzőkönyv!P27","v":3},{"$f":"Jegyzőkönyv!P26","v":3},{"$f":"Jegyzőkönyv!S27","v":5},{"$f":"Jegyzőkönyv!S26","v":1},{"$f":"Jegyzőkönyv!V27","v":3},{"$f":"Jegyzőkönyv!V26","v":3},{"$f":"Jegyzőkönyv!Y27","v":5},{"$f":"Jegyzőkönyv!Y26","v":1},{"$f":"Jegyzőkönyv!AB27","v":5},{"$f":"Jegyzőkönyv!AB26","v":1},{"$f":"Jegyzőkönyv!AE27","v":3},{"$f":"Jegyzőkönyv!AE26","v":3},{"$f":"Jegyzőkönyv!AG23","v":41},{"$f":"Jegyzőkönyv!AH23","v":1}]
[6,{"$f":"IF(ISBLANK(Jegyzőkönyv!B28),\"\",Jegyzőkönyv!B28)","v":""},{"$f":"Jegyzőkönyv!D32","v":""},{"$f":"Jegyzőkönyv!D31","v":""},{"$f":"Jegyzőkönyv!G32","v":""},{"$f":"Jegyzőkönyv!G31","v":""},{"$f":"Jegyzőkönyv!J32","v":""},{"$f":"Jegyzőkönyv!J31","v":""},{"$f":"Jegyzőkönyv!M32","v":""},{"$f":"Jegyzőkönyv!M31","v":""},{"$f":"Jegyzőkönyv!P32","v":""},{"$f":"Jegyzőkönyv!P31","v":""},{"$f":"Jegyzőkönyv!S32","v":""},{"$f":"Jegyzőkönyv!S31","v":""},{"$f":"Jegyzőkönyv!V32","v":""},{"$f":"Jegyzőkönyv!V31","v":""},{"$f":"Jegyzőkönyv!Y32","v":""},{"$f":"Jegyzőkönyv!Y31","v":""},{"$f":"Jegyzőkönyv!AB32","v":""},{"$f":"Jegyzőkönyv!AB31","v":""},{"$f":"Jegyzőkönyv!AE32","v":""},{"$f":"Jegyzőkönyv!AE31","v":""},{"$f":"Jegyzőkönyv!AG28","v":""},{"$f":"Jegyzőkönyv!AH28","v":""}]
[7,{"$f":"IF(ISBLANK(Jegyzőkönyv!B33),\"\",Jegyzőkönyv!B33)","v":""},{"$f":"Jegyzőkönyv!D37","v":""},{"$f":"Jegyzőkönyv!D36","v":""},{"$f":"Jegyzőkönyv!G37","v":""},{"$f":"Jegyzőkönyv!G36","v":""},{"$f":"Jegyzőkönyv!J37","v":""},{"$f":"Jegyzőkönyv!J36","v":""},{"$f":"Jegyzőkönyv!M37","v":""},{"$f":"Jegyzőkönyv!M36","v":""},{"$f":"Jegyzőkönyv!P37","v":""},{"$f":"Jegyzőkönyv!P36","v":""},{"$f":"Jegyzőkönyv!S37","v":""},{"$f":"Jegyzőkönyv!S36","v":""},{"$f":"Jegyzőkönyv!V37","v":""},{"$f":"Jegyzőkönyv!V36","v":""},{"$f":"Jegyzőkönyv!Y37","v":""},{"$f":"Jegyzőkönyv!Y36","v":""},{"$f":"Jegyzőkönyv!AB37","v":""},{"$f":"Jegyzőkönyv!AB36","v":""},{"$f":"Jegyzőkönyv!AE37","v":""},{"$f":"Jegyzőkönyv!AE36","v":""},{"$f":"Jegyzőkönyv!AG33","v":""},{"$f":"Jegyzőkönyv!AH33","v":""}]
[8,{"$f":"IF(ISBLANK(Jegyzőkönyv!B38),\"\",Jegyzőkönyv!B38)","v":""},{"$f":"Jegyzőkönyv!D42","v":""},{"$f":"Jegyzőkönyv!D41","v":""},{"$f":"Jegyzőkönyv!G42","v":""},{"$f":"Jegyzőkönyv!G41","v":""},{"$f":"Jegyzőkönyv!J42","v":""},{"$f":"Jegyzőkönyv!J41","v":""},{"$f":"Jegyzőkönyv!M42","v":""},{"$f":"Jegyzőkönyv!M41","v":""},{"$f":"Jegyzőkönyv!P42","v":""},{"$f":"Jegyzőkönyv!P41","v":""},{"$f":"Jegyzőkönyv!S42","v":""},{"$f":"Jegyzőkönyv!S41","v":""},{"$f":"Jegyzőkönyv!V42","v":""},{"$f":"Jegyzőkönyv!V41","v":""},{"$f":"Jegyzőkönyv!Y42","v":""},{"$f":"Jegyzőkönyv!Y41","v":""},{"$f":"Jegyzőkönyv!AB42","v":""},{"$f":"Jegyzőkönyv!AB41","v":""},{"$f":"Jegyzőkönyv!AE42","v":""},{"$f":"Jegyzőkönyv!AE41","v":""},{"$f":"Jegyzőkönyv!AG38","v":""},{"$f":"Jegyzőkönyv!AH38","v":""}]
[9,{"$f":"IF(ISBLANK(Jegyzőkönyv!B43),\"\",Jegyzőkönyv!B43)","v":""},{"$f":"Jegyzőkönyv!D47","v":""},{"$f":"Jegyzőkönyv!D46","v":""},{"$f":"Jegyzőkönyv!G47","v":""},{"$f":"Jegyzőkönyv!G46","v":""},{"$f":"Jegyzőkönyv!J47","v":""},{"$f":"Jegyzőkönyv!J46","v":""},{"$f":"Jegyzőkönyv!M47","v":""},{"$f":"Jegyzőkönyv!M46","v":""},{"$f":"Jegyzőkönyv!P47","v":""},{"$f":"Jegyzőkönyv!P46","v":""},{"$f":"Jegyzőkönyv!S47","v":""},{"$f":"Jegyzőkönyv!S46","v":""},{"$f":"Jegyzőkönyv!V47","v":""},{"$f":"Jegyzőkönyv!V46","v":""},{"$f":"Jegyzőkönyv!Y47","v":""},{"$f":"Jegyzőkönyv!Y46","v":""},{"$f":"Jegyzőkönyv!AB47","v":""},{"$f":"Jegyzőkönyv!AB46","v":""},{"$f":"Jegyzőkönyv!AE47","v":""},{"$f":"Jegyzőkönyv!AE46","v":""},{"$f":"Jegyzőkönyv!AG43","v":""},{"$f":"Jegyzőkönyv!AH43","v":""}]
[10,{"$f":"IF(ISBLANK(Jegyzőkönyv!B48),\"\",Jegyzőkönyv!B48)","v":""},{"$f":"Jegyzőkönyv!D52","v":""},{"$f":"Jegyzőkönyv!D51","v":""},{"$f":"Jegyzőkönyv!G52","v":""},{"$f":"Jegyzőkönyv!G51","v":""},{"$f":"Jegyzőkönyv!J52","v":""},{"$f":"Jegyzőkönyv!J51","v":""},{"$f":"Jegyzőkönyv!M52","v":""},{"$f":"Jegyzőkönyv!M51","v":""},{"$f":"Jegyzőkönyv!P52","v":""},{"$f":"Jegyzőkönyv!P51","v":""},{"$f":"Jegyzőkönyv!S52","v":""},{"$f":"Jegyzőkönyv!S51","v":""},{"$f":"Jegyzőkönyv!V52","v":""},{"$f":"Jegyzőkönyv!V51","v":""},{"$f":"Jegyzőkönyv!Y52","v":""},{"$f":"Jegyzőkönyv!Y51","v":""},{"$f":"Jegyzőkönyv!AB52","v":""},{"$f":"Jegyzőkönyv!AB51","v":""},{"$f":"Jegyzőkönyv!AE52","v":""},{"$f":"Jegyzőkönyv!AE51","v":""},{"$f":"Jegyzőkönyv!AG48","v":""},{"$f":"Jegyzőkönyv!AH48","v":""}]
[11,{"$f":"IF(ISBLANK(Jegyzőkönyv!B53),\"\",Jegyzőkönyv!B53)","v":""},{"$f":"Jegyzőkönyv!D57","v":""},{"$f":"Jegyzőkönyv!D56","v":""},{"$f":"Jegyzőkönyv!G57","v":""},{"$f":"Jegyzőkönyv!G56","v":""},{"$f":"Jegyzőkönyv!J57","v":""},{"$f":"Jegyzőkönyv!J56","v":""},{"$f":"Jegyzőkönyv!M57","v":""},{"$f":"Jegyzőkönyv!M56","v":""},{"$f":"Jegyzőkönyv!P57","v":""},{"$f":"Jegyzőkönyv!P56","v":""},{"$f":"Jegyzőkönyv!S57","v":""},{"$f":"Jegyzőkönyv!S56","v":""},{"$f":"Jegyzőkönyv!V57","v":""},{"$f":"Jegyzőkönyv!V56","v":""},{"$f":"Jegyzőkönyv!Y57","v":""},{"$f":"Jegyzőkönyv!Y56","v":""},{"$f":"Jegyzőkönyv!AB57","v":""},{"$f":"Jegyzőkönyv!AB56","v":""},{"$f":"Jegyzőkönyv!AE57","v":""},{"$f":"Jegyzőkönyv!AE56","v":""},{"$f":"Jegyzőkönyv!AG53","v":""},{"$f":"Jegyzőkönyv!AH53","v":""}]
[12,{"$f":"IF(ISBLANK(Jegyzőkönyv!B58),\"\",Jegyzőkönyv!B58)","v":""},{"$f":"Jegyzőkönyv!D62","v":""},{"$f":"Jegyzőkönyv!D61","v":""},{"$f":"Jegyzőkönyv!G62","v":""},{"$f":"Jegyzőkönyv!G61","v":""},{"$f":"Jegyzőkönyv!J62","v":""},{"$f":"Jegyzőkönyv!J61","v":""},{"$f":"Jegyzőkönyv!M62","v":""},{"$f":"Jegyzőkönyv!M61","v":""},{"$f":"Jegyzőkönyv!P62","v":""},{"$f":"Jegyzőkönyv!P61","v":""},{"$f":"Jegyzőkönyv!S62","v":""},{"$f":"Jegyzőkönyv!S61","v":""},{"$f":"Jegyzőkönyv!V62","v":""},{"$f":"Jegyzőkönyv!V61","v":""},{"$f":"Jegyzőkönyv!Y62","v":""},{"$f":"Jegyzőkönyv!Y61","v":""},{"$f":"Jegyzőkönyv!AB62","v":""},{"$f":"Jegyzőkönyv!AB61","v":""},{"$f":"Jegyzőkönyv!AE62","v":""},{"$f":"Jegyzőkönyv!AE61","v":""},{"$f":"Jegyzőkönyv!AG58","v":""},{"$f":"Jegyzőkönyv!AH58","v":""}]