{"text_format":"1","workbook":"xlsx","n_sheets":9,"sheets":["Altalanos","Birók","piros lány elo","1MD 8","1MD 16","narancs lány elo","1E5 (4)","Zőld lány elo","1E5 (3)"],"not_rendered":{"charts":0,"images":9,"macros":1,"external_links":0,"defined_names":25,"comments":5,"pivot_tables":0},"unopened":[],"bounds":{"document_bytes":16777216,"sheet_cells":100000,"rows_first":2000,"rows_last":500,"rows_between":2000,"halvings":0,"cell_chars":16384,"cell_head_chars":4096},"cells_cut":0,"cells_raw":0,"read":"whole","date_system":"1900"}

{"sheet":"Altalanos","index":0,"n_rows":12,"n_cols":5,"rows_kept":12,"cut":false,"hidden":false,"merged":[]}
["Magyar verseny táblakészítő"]
["Ezt az oldalt soha ne töröld le !!!"]
[]
["Töltsd ki a zöld mezőket!"]
["A verseny neve:"]
["Diákolimpia Orsz. Döntő"]
["Versenyszám 1","Versenyszám 2","Versenyszám 3","Versenyszám 4","Versenyszám 5"]
["Piros lány",null,"Zöld lány","Nrancs lány"]
["A verseny dátuma (éééé.hh.nn)",null,"Város",null,"Versenybíró:"]
["2018.05.28-31.",null,"Balatonboglár","  ","Rákóczi Andrea"]
[null,null,"Orvos neve:","Verseny rendezője:","Versenyigazgató"]
[null,null,null,"BBTC SE","Kiss Gabriella"]

{"sheet":"Birók","index":1,"n_rows":30,"n_cols":16,"rows_kept":30,"cut":false,"hidden":false,"merged":[[5,0,5,1]]}
[{"$f":"Altalanos!$A$6","v":"Diákolimpia Orsz. Döntő"}]
[]
[null,"Közreműködő bírók"]
["Dátum","Város"]
[{"$f":"Altalanos!$A$10","v":"2018.05.28-31."},{"$f":"Altalanos!$C$10","v":"Balatonboglár"}]
["Töltsd ki a táblázatot a játékvezetők nevével. Az első 8 neve fog megjelenni a táblákban lévő legördülő menükben"]
[]
[]
[]
[]
[]
[]
[]
[]
[]
[]
[]
[]
[]
["Székbírók"]
["Családi név","Keresztnév",null,null,null,null,null,null,null,null,null,null,null,null,null,"Bíró"]
[null,null,null,null,null,null,null,null,null,null,null,null,null,null,null,{"$f":"LEFT(B22,1)&\" \"&A22","v":" "}]
[null,null,null,null,null,null,null,null,null,null,null,null,null,null,null," "]
[null,null,null,null,null,null,null,null,null,null,null,null,null,null,null," "]
[null,null,null,null,null,null,null,null,null,null,null,null,null,null,null," "]
[null,null,null,null,null,null,null,null,null,null,null,null,null,null,null," "]
[null,null,null,null,null,null,null,null,null,null,null,null,null,null,null," "]
[null,null,null,null,null,null,null,null,null,null,null,null,null,null,null," "]
[null,null,null,null,null,null,null,null,null,null,null,null,null,null,null," "]
[null,null,null,null,null,null,null,null,null,null,null,null,null,null,null,"Egyik sem"]

{"sheet":"piros lány elo","index":2,"n_rows":156,"n_cols":17,"rows_kept":156,"cut":false,"hidden":false,"merged":[]}
[{"$f":"Altalanos!$A$6","v":"Diákolimpia Orsz. Döntő"},null,null,null,"Egyéni főtábla"]
[null,"Versenyszám:",{"$f":"Altalanos!$A$8","v":"Piros lány"},null,"ELŐKÉSZÍTŐ LISTA"]
["NE TÖRÖLD KI EZT AZ OLDALT!     ",null,null,null,null,null,null,null,null,null,null,null,null,"Versenybíró aláírása"]
["Dátum",null,"Város","Kategória",null,null,null,"Versenybíró"]
[{"$f":"Altalanos!$A$10","v":"2018.05.28-31."},null,{"$f":"Altalanos!$C$10","v":"Balatonboglár"},{"$f":"Altalanos!$D$10","v":"  "},null,null,null,{"$f":"Altalanos!$E$10","v":"Rákóczi Andrea"}]
["Sor","Családi név","Keresztnév","Egyesület","Kódszám","Nevezett Igen","Aláírás","Nevezési rangsor",null,"NatSort\nif not \nSeed","NatSort","Seed Sort","AccBasic","Elfogadási státusz","Sorsolási rangsor","AccSort","Kiemelés"]
[1,"Bencés Apátság Illyés Gyula Ált és Alapfokú Művészeti Iskolája",null,"Tihany"]
[2,"Boglári Általános Iskola és Alapfokú Művészeti Iskola",null,"Balatonboglár"]
[3,"Diósgyőri Nagy Lajos Király Általános Iskola A",null,"Miskolc"]
[4]
[5,"Kazincbarcikai Pollack Mihály Általános Iskola",null,"Kazincbarcika"]
[6,"Kiskunfélegyházi József Attila Általános Iskola",null,"Kiskunfélegyháza"]
[7,"Paragvári Utcai Általános Iskola",null,"Szombathely"]
[8,"Pécsi Bártfa Utcai Általános Iskola A",null,"Pécs"]
[9,"Pécsi Bártfa Utcai Általános Iskola B",null,"Pécs"]
[10,"Szent II. János Pál Óvoda, Általános Iskola és Gimnázium, Bp.",null,"Budapest"]
[11,"Sopronkövesdi Általános Iskola",null,"Sopronkövesd"]
[12]
[13]
[14]
[15]
[16]
[17]
[18]
[19]
[20]
[21]
[22]
[23]
[24]
[25]
[26]
[27]
[28]
[29]
[30]
[31]
[32]
[33]
[34,null,null,null,null,null,null,null,null,{"$f":"IF(AND(Q40=\"\",#REF!>0,#REF!<5),K40,)","v":{"$error":"#REF!"}},{"$f":"IF(D40=\"\",\"ZZZ9\",IF(AND(#REF!>0,#REF!<5),D40&#REF!,D40&\"9\"))","v":"ZZZ9"},{"$f":"IF(Q40=\"\",999,Q40)","v":999},{"$f":"IF(P40=999,999,1)","v":999},null,null,{"$f":"IF(N40=\"DA\",1,IF(N40=\"WC\",2,IF(N40=\"SE\",3,IF(N40=\"Q\",4,IF(N40=\"LL\",5,999)))))","v":999}]
[35,null,null,null,null,null,null,null,null,{"$f":"IF(AND(Q41=\"\",#REF!>0,#REF!<5),K41,)","v":{"$error":"#REF!"}},{"$f":"IF(D41=\"\",\"ZZZ9\",IF(AND(#REF!>0,#REF!<5),D41&#REF!,D41&\"9\"))","v":"ZZZ9"},999,999,null,null,999]
[36,null,null,null,null,null,null,null,null,{"$f":"IF(AND(Q42=\"\",#REF!>0,#REF!<5),K42,)","v":{"$error":"#REF!"}},{"$f":"IF(D42=\"\",\"ZZZ9\",IF(AND(#REF!>0,#REF!<5),D42&#REF!,D42&\"9\"))","v":"ZZZ9"},999,999,null,null,999]
[37,null,null,null,null,null,null,null,null,{"$f":"IF(AND(Q43=\"\",#REF!>0,#REF!<5),K43,)","v":{"$error":"#REF!"}},{"$f":"IF(D43=\"\",\"ZZZ9\",IF(AND(#REF!>0,#REF!<5),D43&#REF!,D43&\"9\"))","v":"ZZZ9"},999,999,null,null,999]
[38,null,null,null,null,null,null,null,null,{"$f":"IF(AND(Q44=\"\",#REF!>0,#REF!<5),K44,)","v":{"$error":"#REF!"}},{"$f":"IF(D44=\"\",\"ZZZ9\",IF(AND(#REF!>0,#REF!<5),D44&#REF!,D44&\"9\"))","v":"ZZZ9"},999,999,null,null,999]
[39,null,null,null,null,null,null,null,null,{"$f":"IF(AND(Q45=\"\",#REF!>0,#REF!<5),K45,)","v":{"$error":"#REF!"}},{"$f":"IF(D45=\"\",\"ZZZ9\",IF(AND(#REF!>0,#REF!<5),D45&#REF!,D45&\"9\"))","v":"ZZZ9"},999,999,null,null,999]
[40,null,null,null,null,null,null,null,null,{"$f":"IF(AND(Q46=\"\",#REF!>0,#REF!<5),K46,)","v":{"$error":"#REF!"}},{"$f":"IF(D46=\"\",\"ZZZ9\",IF(AND(#REF!>0,#REF!<5),D46&#REF!,D46&\"9\"))","v":"ZZZ9"},999,999,null,null,999]
[41,null,null,null,null,null,null,null,null,{"$f":"IF(AND(Q47=\"\",#REF!>0,#REF!<5),K47,)","v":{"$error":"#REF!"}},{"$f":"IF(D47=\"\",\"ZZZ9\",IF(AND(#REF!>0,#REF!<5),D47&#REF!,D47&\"9\"))","v":"ZZZ9"},999,999,null,null,999]
[42,null,null,null,null,null,null,null,null,{"$f":"IF(AND(Q48=\"\",#REF!>0,#REF!<5),K48,)","v":{"$error":"#REF!"}},{"$f":"IF(D48=\"\",\"ZZZ9\",IF(AND(#REF!>0,#REF!<5),D48&#REF!,D48&\"9\"))","v":"ZZZ9"},999,999,null,null,999]
[43,null,null,null,null,null,null,null,null,{"$f":"IF(AND(Q49=\"\",#REF!>0,#REF!<5),K49,)","v":{"$error":"#REF!"}},{"$f":"IF(D49=\"\",\"ZZZ9\",IF(AND(#REF!>0,#REF!<5),D49&#REF!,D49&\"9\"))","v":"ZZZ9"},999,999,null,null,999]
[44,null,null,null,null,null,null,null,null,{"$f":"IF(AND(Q50=\"\",#REF!>0,#REF!<5),K50,)","v":{"$error":"#REF!"}},{"$f":"IF(D50=\"\",\"ZZZ9\",IF(AND(#REF!>0,#REF!<5),D50&#REF!,D50&\"9\"))","v":"ZZZ9"},999,999,null,null,999]
[45,null,null,null,null,null,null,null,null,{"$f":"IF(AND(Q51=\"\",#REF!>0,#REF!<5),K51,)","v":{"$error":"#REF!"}},{"$f":"IF(D51=\"\",\"ZZZ9\",IF(AND(#REF!>0,#REF!<5),D51&#REF!,D51&\"9\"))","v":"ZZZ9"},999,999,null,null,999]
[46,null,null,null,null,null,null,null,null,{"$f":"IF(AND(Q52=\"\",#REF!>0,#REF!<5),K52,)","v":{"$error":"#REF!"}},{"$f":"IF(D52=\"\",\"ZZZ9\",IF(AND(#REF!>0,#REF!<5),D52&#REF!,D52&\"9\"))","v":"ZZZ9"},999,999,null,null,999]
[47,null,null,null,null,null,null,null,null,{"$f":"IF(AND(Q53=\"\",#REF!>0,#REF!<5),K53,)","v":{"$error":"#REF!"}},{"$f":"IF(D53=\"\",\"ZZZ9\",IF(AND(#REF!>0,#REF!<5),D53&#REF!,D53&\"9\"))","v":"ZZZ9"},999,999,null,null,999]
[48,null,null,null,null,null,null,null,null,{"$f":"IF(AND(Q54=\"\",#REF!>0,#REF!<5),K54,)","v":{"$error":"#REF!"}},{"$f":"IF(D54=\"\",\"ZZZ9\",IF(AND(#REF!>0,#REF!<5),D54&#REF!,D54&\"9\"))","v":"ZZZ9"},999,999,null,null,999]
[49,null,null,null,null,null,null,null,null,{"$f":"IF(AND(Q55=\"\",#REF!>0,#REF!<5),K55,)","v":{"$error":"#REF!"}},{"$f":"IF(D55=\"\",\"ZZZ9\",IF(AND(#REF!>0,#REF!<5),D55&#REF!,D55&\"9\"))","v":"ZZZ9"},999,999,null,null,999]
[50,null,null,null,null,null,null,null,null,{"$f":"IF(AND(Q56=\"\",#REF!>0,#REF!<5),K56,)","v":{"$error":"#REF!"}},{"$f":"IF(D56=\"\",\"ZZZ9\",IF(AND(#REF!>0,#REF!<5),D56&#REF!,D56&\"9\"))","v":"ZZZ9"},999,999,null,null,999]
[51,null,null,null,null,null,null,null,null,{"$f":"IF(AND(Q57=\"\",#REF!>0,#REF!<5),K57,)","v":{"$error":"#REF!"}},{"$f":"IF(D57=\"\",\"ZZZ9\",IF(AND(#REF!>0,#REF!<5),D57&#REF!,D57&\"9\"))","v":"ZZZ9"},999,999,null,null,999]
[52,null,null,null,null,null,null,null,null,{"$f":"IF(AND(Q58=\"\",#REF!>0,#REF!<5),K58,)","v":{"$error":"#REF!"}},{"$f":"IF(D58=\"\",\"ZZZ9\",IF(AND(#REF!>0,#REF!<5),D58&#REF!,D58&\"9\"))","v":"ZZZ9"},999,999,null,null,999]
[53,null,null,null,null,null,null,null,null,{"$f":"IF(AND(Q59=\"\",#REF!>0,#REF!<5),K59,)","v":{"$error":"#REF!"}},{"$f":"IF(D59=\"\",\"ZZZ9\",IF(AND(#REF!>0,#REF!<5),D59&#REF!,D59&\"9\"))","v":"ZZZ9"},999,999,null,null,999]
[54,null,null,null,null,null,null,null,null,{"$f":"IF(AND(Q60=\"\",#REF!>0,#REF!<5),K60,)","v":{"$error":"#REF!"}},{"$f":"IF(D60=\"\",\"ZZZ9\",IF(AND(#REF!>0,#REF!<5),D60&#REF!,D60&\"9\"))","v":"ZZZ9"},999,999,null,null,999]
[55,null,null,null,null,null,null,null,null,{"$f":"IF(AND(Q61=\"\",#REF!>0,#REF!<5),K61,)","v":{"$error":"#REF!"}},{"$f":"IF(D61=\"\",\"ZZZ9\",IF(AND(#REF!>0,#REF!<5),D61&#REF!,D61&\"9\"))","v":"ZZZ9"},999,999,null,null,999]
[56,null,null,null,null,null,null,null,null,{"$f":"IF(AND(Q62=\"\",#REF!>0,#REF!<5),K62,)","v":{"$error":"#REF!"}},{"$f":"IF(D62=\"\",\"ZZZ9\",IF(AND(#REF!>0,#REF!<5),D62&#REF!,D62&\"9\"))","v":"ZZZ9"},999,999,null,null,999]
[57,null,null,null,null,null,null,null,null,{"$f":"IF(AND(Q63=\"\",#REF!>0,#REF!<5),K63,)","v":{"$error":"#REF!"}},{"$f":"IF(D63=\"\",\"ZZZ9\",IF(AND(#REF!>0,#REF!<5),D63&#REF!,D63&\"9\"))","v":"ZZZ9"},999,999,null,null,999]
[58,null,null,null,null,null,null,null,null,{"$f":"IF(AND(Q64=\"\",#REF!>0,#REF!<5),K64,)","v":{"$error":"#REF!"}},{"$f":"IF(D64=\"\",\"ZZZ9\",IF(AND(#REF!>0,#REF!<5),D64&#REF!,D64&\"9\"))","v":"ZZZ9"},999,999,null,null,999]
[59,null,null,null,null,null,null,null,null,{"$f":"IF(AND(Q65=\"\",#REF!>0,#REF!<5),K65,)","v":{"$error":"#REF!"}},{"$f":"IF(D65=\"\",\"ZZZ9\",IF(AND(#REF!>0,#REF!<5),D65&#REF!,D65&\"9\"))","v":"ZZZ9"},999,999,null,null,999]
[60,null,null,null,null,null,null,null,null,{"$f":"IF(AND(Q66=\"\",#REF!>0,#REF!<5),K66,)","v":{"$error":"#REF!"}},{"$f":"IF(D66=\"\",\"ZZZ9\",IF(AND(#REF!>0,#REF!<5),D66&#REF!,D66&\"9\"))","v":"ZZZ9"},999,999,null,null,999]
[61,null,null,null,null,null,null,null,null,{"$f":"IF(AND(Q67=\"\",#REF!>0,#REF!<5),K67,)","v":{"$error":"#REF!"}},{"$f":"IF(D67=\"\",\"ZZZ9\",IF(AND(#REF!>0,#REF!<5),D67&#REF!,D67&\"9\"))","v":"ZZZ9"},999,999,null,null,999]
[62,null,null,null,null,null,null,null,null,{"$f":"IF(AND(Q68=\"\",#REF!>0,#REF!<5),K68,)","v":{"$error":"#REF!"}},{"$f":"IF(D68=\"\",\"ZZZ9\",IF(AND(#REF!>0,#REF!<5),D68&#REF!,D68&\"9\"))","v":"ZZZ9"},999,999,null,null,999]
[63,null,null,null,null,null,null,null,null,{"$f":"IF(AND(Q69=\"\",#REF!>0,#REF!<5),K69,)","v":{"$error":"#REF!"}},{"$f":"IF(D69=\"\",\"ZZZ9\",IF(AND(#REF!>0,#REF!<5),D69&#REF!,D69&\"9\"))","v":"ZZZ9"},999,999,null,null,999]
[64,null,null,null,null,null,null,null,null,{"$f":"IF(AND(Q70=\"\",#REF!>0,#REF!<5),K70,)","v":{"$error":"#REF!"}},{"$f":"IF(D70=\"\",\"ZZZ9\",IF(AND(#REF!>0,#REF!<5),D70&#REF!,D70&\"9\"))","v":"ZZZ9"},999,999,null,null,999]
[65,null,null,null,null,null,null,null,null,{"$f":"IF(AND(Q71=\"\",#REF!>0,#REF!<5),K71,)","v":{"$error":"#REF!"}},{"$f":"IF(D71=\"\",\"ZZZ9\",IF(AND(#REF!>0,#REF!<5),D71&#REF!,D71&\"9\"))","v":"ZZZ9"},999,999,null,null,999]
[66,null,null,null,null,null,null,null,null,{"$f":"IF(AND(Q72=\"\",#REF!>0,#REF!<5),K72,)","v":{"$error":"#REF!"}},{"$f":"IF(D72=\"\",\"ZZZ9\",IF(AND(#REF!>0,#REF!<5),D72&#REF!,D72&\"9\"))","v":"ZZZ9"},{"$f":"IF(Q72=\"\",999,Q72)","v":999},{"$f":"IF(P72=999,999,1)","v":999},null,null,{"$f":"IF(N72=\"DA\",1,IF(N72=\"WC\",2,IF(N72=\"SE\",3,IF(N72=\"Q\",4,IF(N72=\"LL\",5,999)))))","v":999}]
[67,null,null,null,null,null,null,null,null,{"$f":"IF(AND(Q73=\"\",#REF!>0,#REF!<5),K73,)","v":{"$error":"#REF!"}},{"$f":"IF(D73=\"\",\"ZZZ9\",IF(AND(#REF!>0,#REF!<5),D73&#REF!,D73&\"9\"))","v":"ZZZ9"},999,999,null,null,999]
[68,null,null,null,null,null,null,null,null,{"$f":"IF(AND(Q74=\"\",#REF!>0,#REF!<5),K74,)","v":{"$error":"#REF!"}},{"$f":"IF(D74=\"\",\"ZZZ9\",IF(AND(#REF!>0,#REF!<5),D74&#REF!,D74&\"9\"))","v":"ZZZ9"},999,999,null,null,999]
[69,null,null,null,null,null,null,null,null,{"$f":"IF(AND(Q75=\"\",#REF!>0,#REF!<5),K75,)","v":{"$error":"#REF!"}},{"$f":"IF(D75=\"\",\"ZZZ9\",IF(AND(#REF!>0,#REF!<5),D75&#REF!,D75&\"9\"))","v":"ZZZ9"},999,999,null,null,999]
[70,null,null,null,null,null,null,null,null,{"$f":"IF(AND(Q76=\"\",#REF!>0,#REF!<5),K76,)","v":{"$error":"#REF!"}},{"$f":"IF(D76=\"\",\"ZZZ9\",IF(AND(#REF!>0,#REF!<5),D76&#REF!,D76&\"9\"))","v":"ZZZ9"},999,999,null,null,999]
[71,null,null,null,null,null,null,null,null,{"$f":"IF(AND(Q77=\"\",#REF!>0,#REF!<5),K77,)","v":{"$error":"#REF!"}},{"$f":"IF(D77=\"\",\"ZZZ9\",IF(AND(#REF!>0,#REF!<5),D77&#REF!,D77&\"9\"))","v":"ZZZ9"},999,999,null,null,999]
[72,null,null,null,null,null,null,null,null,{"$f":"IF(AND(Q78=\"\",#REF!>0,#REF!<5),K78,)","v":{"$error":"#REF!"}},{"$f":"IF(D78=\"\",\"ZZZ9\",IF(AND(#REF!>0,#REF!<5),D78&#REF!,D78&\"9\"))","v":"ZZZ9"},999,999,null,null,999]
[73,null,null,null,null,null,null,null,null,{"$f":"IF(AND(Q79=\"\",#REF!>0,#REF!<5),K79,)","v":{"$error":"#REF!"}},{"$f":"IF(D79=\"\",\"ZZZ9\",IF(AND(#REF!>0,#REF!<5),D79&#REF!,D79&\"9\"))","v":"ZZZ9"},999,999,null,null,999]
[74,null,null,null,null,null,null,null,null,{"$f":"IF(AND(Q80=\"\",#REF!>0,#REF!<5),K80,)","v":{"$error":"#REF!"}},{"$f":"IF(D80=\"\",\"ZZZ9\",IF(AND(#REF!>0,#REF!<5),D80&#REF!,D80&\"9\"))","v":"ZZZ9"},999,999,null,null,999]
[75,null,null,null,null,null,null,null,null,{"$f":"IF(AND(Q81=\"\",#REF!>0,#REF!<5),K81,)","v":{"$error":"#REF!"}},{"$f":"IF(D81=\"\",\"ZZZ9\",IF(AND(#REF!>0,#REF!<5),D81&#REF!,D81&\"9\"))","v":"ZZZ9"},999,999,null,null,999]
[76,null,null,null,null,null,null,null,null,{"$f":"IF(AND(Q82=\"\",#REF!>0,#REF!<5),K82,)","v":{"$error":"#REF!"}},{"$f":"IF(D82=\"\",\"ZZZ9\",IF(AND(#REF!>0,#REF!<5),D82&#REF!,D82&\"9\"))","v":"ZZZ9"},999,999,null,null,999]
[77,null,null,null,null,null,null,null,null,{"$f":"IF(AND(Q83=\"\",#REF!>0,#REF!<5),K83,)","v":{"$error":"#REF!"}},{"$f":"IF(D83=\"\",\"ZZZ9\",IF(AND(#REF!>0,#REF!<5),D83&#REF!,D83&\"9\"))","v":"ZZZ9"},999,999,null,null,999]
[78,null,null,null,null,null,null,null,null,{"$f":"IF(AND(Q84=\"\",#REF!>0,#REF!<5),K84,)","v":{"$error":"#REF!"}},{"$f":"IF(D84=\"\",\"ZZZ9\",IF(AND(#REF!>0,#REF!<5),D84&#REF!,D84&\"9\"))","v":"ZZZ9"},999,999,null,null,999]
[79,null,null,null,null,null,null,null,null,{"$f":"IF(AND(Q85=\"\",#REF!>0,#REF!<5),K85,)","v":{"$error":"#REF!"}},{"$f":"IF(D85=\"\",\"ZZZ9\",IF(AND(#REF!>0,#REF!<5),D85&#REF!,D85&\"9\"))","v":"ZZZ9"},999,999,null,null,999]
[80,null,null,null,null,null,null,null,null,{"$f":"IF(AND(Q86=\"\",#REF!>0,#REF!<5),K86,)","v":{"$error":"#REF!"}},{"$f":"IF(D86=\"\",\"ZZZ9\",IF(AND(#REF!>0,#REF!<5),D86&#REF!,D86&\"9\"))","v":"ZZZ9"},999,999,null,null,999]
[81,null,null,null,null,null,null,null,null,{"$f":"IF(AND(Q87=\"\",#REF!>0,#REF!<5),K87,)","v":{"$error":"#REF!"}},{"$f":"IF(D87=\"\",\"ZZZ9\",IF(AND(#REF!>0,#REF!<5),D87&#REF!,D87&\"9\"))","v":"ZZZ9"},999,999,null,null,999]
[82,null,null,null,null,null,null,null,null,{"$f":"IF(AND(Q88=\"\",#REF!>0,#REF!<5),K88,)","v":{"$error":"#REF!"}},{"$f":"IF(D88=\"\",\"ZZZ9\",IF(AND(#REF!>0,#REF!<5),D88&#REF!,D88&\"9\"))","v":"ZZZ9"},999,999,null,null,999]
[83,null,null,null,null,null,null,null,null,{"$f":"IF(AND(Q89=\"\",#REF!>0,#REF!<5),K89,)","v":{"$error":"#REF!"}},{"$f":"IF(D89=\"\",\"ZZZ9\",IF(AND(#REF!>0,#REF!<5),D89&#REF!,D89&\"9\"))","v":"ZZZ9"},999,999,null,null,999]
[84,null,null,null,null,null,null,null,null,{"$f":"IF(AND(Q90=\"\",#REF!>0,#REF!<5),K90,)","v":{"$error":"#REF!"}},{"$f":"IF(D90=\"\",\"ZZZ9\",IF(AND(#REF!>0,#REF!<5),D90&#REF!,D90&\"9\"))","v":"ZZZ9"},999,999,null,null,999]
[85,null,null,null,null,null,null,null,null,{"$f":"IF(AND(Q91=\"\",#REF!>0,#REF!<5),K91,)","v":{"$error":"#REF!"}},{"$f":"IF(D91=\"\",\"ZZZ9\",IF(AND(#REF!>0,#REF!<5),D91&#REF!,D91&\"9\"))","v":"ZZZ9"},999,999,null,null,999]
[86,null,null,null,null,null,null,null,null,{"$f":"IF(AND(Q92=\"\",#REF!>0,#REF!<5),K92,)","v":{"$error":"#REF!"}},{"$f":"IF(D92=\"\",\"ZZZ9\",IF(AND(#REF!>0,#REF!<5),D92&#REF!,D92&\"9\"))","v":"ZZZ9"},999,999,null,null,999]
[87,null,null,null,null,null,null,null,null,{"$f":"IF(AND(Q93=\"\",#REF!>0,#REF!<5),K93,)","v":{"$error":"#REF!"}},{"$f":"IF(D93=\"\",\"ZZZ9\",IF(AND(#REF!>0,#REF!<5),D93&#REF!,D93&\"9\"))","v":"ZZZ9"},999,999,null,null,999]
[88,null,null,null,null,null,null,null,null,{"$f":"IF(AND(Q94=\"\",#REF!>0,#REF!<5),K94,)","v":{"$error":"#REF!"}},{"$f":"IF(D94=\"\",\"ZZZ9\",IF(AND(#REF!>0,#REF!<5),D94&#REF!,D94&\"9\"))","v":"ZZZ9"},999,999,null,null,999]
[89,null,null,null,null,null,null,null,null,{"$f":"IF(AND(Q95=\"\",#REF!>0,#REF!<5),K95,)","v":{"$error":"#REF!"}},{"$f":"IF(D95=\"\",\"ZZZ9\",IF(AND(#REF!>0,#REF!<5),D95&#REF!,D95&\"9\"))","v":"ZZZ9"},999,999,null,null,999]
[90,null,null,null,null,null,null,null,null,{"$f":"IF(AND(Q96=\"\",#REF!>0,#REF!<5),K96,)","v":{"$error":"#REF!"}},{"$f":"IF(D96=\"\",\"ZZZ9\",IF(AND(#REF!>0,#REF!<5),D96&#REF!,D96&\"9\"))","v":"ZZZ9"},999,999,null,null,999]
[91,null,null,null,null,null,null,null,null,{"$f":"IF(AND(Q97=\"\",#REF!>0,#REF!<5),K97,)","v":{"$error":"#REF!"}},{"$f":"IF(D97=\"\",\"ZZZ9\",IF(AND(#REF!>0,#REF!<5),D97&#REF!,D97&\"9\"))","v":"ZZZ9"},999,999,null,null,999]
[92,null,null,null,null,null,null,null,null,{"$f":"IF(AND(Q98=\"\",#REF!>0,#REF!<5),K98,)","v":{"$error":"#REF!"}},{"$f":"IF(D98=\"\",\"ZZZ9\",IF(AND(#REF!>0,#REF!<5),D98&#REF!,D98&\"9\"))","v":"ZZZ9"},999,999,null,null,999]
[93,null,null,null,null,null,null,null,null,{"$f":"IF(AND(Q99=\"\",#REF!>0,#REF!<5),K99,)","v":{"$error":"#REF!"}},{"$f":"IF(D99=\"\",\"ZZZ9\",IF(AND(#REF!>0,#REF!<5),D99&#REF!,D99&\"9\"))","v":"ZZZ9"},999,999,null,null,999]
[94,null,null,null,null,null,null,null,null,{"$f":"IF(AND(Q100=\"\",#REF!>0,#REF!<5),K100,)","v":{"$error":"#REF!"}},{"$f":"IF(D100=\"\",\"ZZZ9\",IF(AND(#REF!>0,#REF!<5),D100&#REF!,D100&\"9\"))","v":"ZZZ9"},999,999,null,null,999]
[95,null,null,null,null,null,null,null,null,{"$f":"IF(AND(Q101=\"\",#REF!>0,#REF!<5),K101,)","v":{"$error":"#REF!"}},{"$f":"IF(D101=\"\",\"ZZZ9\",IF(AND(#REF!>0,#REF!<5),D101&#REF!,D101&\"9\"))","v":"ZZZ9"},{"$f":"IF(Q101=\"\",999,Q101)","v":999},{"$f":"IF(P101=999,999,1)","v":999},null,null,{"$f":"IF(N101=\"DA\",1,IF(N101=\"WC\",2,IF(N101=\"SE\",3,IF(N101=\"Q\",4,IF(N101=\"LL\",5,999)))))","v":999}]
[96,null,null,null,null,null,null,null,null,{"$f":"IF(AND(Q102=\"\",#REF!>0,#REF!<5),K102,)","v":{"$error":"#REF!"}},{"$f":"IF(D102=\"\",\"ZZZ9\",IF(AND(#REF!>0,#REF!<5),D102&#REF!,D102&\"9\"))","v":"ZZZ9"},999,999,null,null,999]
[97,null,null,null,null,null,null,null,null,{"$f":"IF(AND(Q103=\"\",#REF!>0,#REF!<5),K103,)","v":{"$error":"#REF!"}},{"$f":"IF(D103=\"\",\"ZZZ9\",IF(AND(#REF!>0,#REF!<5),D103&#REF!,D103&\"9\"))","v":"ZZZ9"},999,999,null,null,999]
[98,null,null,null,null,null,null,null,null,{"$f":"IF(AND(Q104=\"\",#REF!>0,#REF!<5),K104,)","v":{"$error":"#REF!"}},{"$f":"IF(D104=\"\",\"ZZZ9\",IF(AND(#REF!>0,#REF!<5),D104&#REF!,D104&\"9\"))","v":"ZZZ9"},999,999,null,null,999]
[99,null,null,null,null,null,null,null,null,{"$f":"IF(AND(Q105=\"\",#REF!>0,#REF!<5),K105,)","v":{"$error":"#REF!"}},{"$f":"IF(D105=\"\",\"ZZZ9\",IF(AND(#REF!>0,#REF!<5),D105&#REF!,D105&\"9\"))","v":"ZZZ9"},999,999,null,null,999]
[100,null,null,null,null,null,null,null,null,{"$f":"IF(AND(Q106=\"\",#REF!>0,#REF!<5),K106,)","v":{"$error":"#REF!"}},{"$f":"IF(D106=\"\",\"ZZZ9\",IF(AND(#REF!>0,#REF!<5),D106&#REF!,D106&\"9\"))","v":"ZZZ9"},999,999,null,null,999]
[101,null,null,null,null,null,null,null,null,{"$f":"IF(AND(Q107=\"\",#REF!>0,#REF!<5),K107,)","v":{"$error":"#REF!"}},{"$f":"IF(D107=\"\",\"ZZZ9\",IF(AND(#REF!>0,#REF!<5),D107&#REF!,D107&\"9\"))","v":"ZZZ9"},999,999,null,null,999]
[102,null,null,null,null,null,null,null,null,{"$f":"IF(AND(Q108=\"\",#REF!>0,#REF!<5),K108,)","v":{"$error":"#REF!"}},{"$f":"IF(D108=\"\",\"ZZZ9\",IF(AND(#REF!>0,#REF!<5),D108&#REF!,D108&\"9\"))","v":"ZZZ9"},999,999,null,null,999]
[103,null,null,null,null,null,null,null,null,{"$f":"IF(AND(Q109=\"\",#REF!>0,#REF!<5),K109,)","v":{"$error":"#REF!"}},{"$f":"IF(D109=\"\",\"ZZZ9\",IF(AND(#REF!>0,#REF!<5),D109&#REF!,D109&\"9\"))","v":"ZZZ9"},999,999,null,null,999]
[104,null,null,null,null,null,null,null,null,{"$f":"IF(AND(Q110=\"\",#REF!>0,#REF!<5),K110,)","v":{"$error":"#REF!"}},{"$f":"IF(D110=\"\",\"ZZZ9\",IF(AND(#REF!>0,#REF!<5),D110&#REF!,D110&\"9\"))","v":"ZZZ9"},999,999,null,null,999]
[105,null,null,null,null,null,null,null,null,{"$f":"IF(AND(Q111=\"\",#REF!>0,#REF!<5),K111,)","v":{"$error":"#REF!"}},{"$f":"IF(D111=\"\",\"ZZZ9\",IF(AND(#REF!>0,#REF!<5),D111&#REF!,D111&\"9\"))","v":"ZZZ9"},999,999,null,null,999]
[106,null,null,null,null,null,null,null,null,{"$f":"IF(AND(Q112=\"\",#REF!>0,#REF!<5),K112,)","v":{"$error":"#REF!"}},{"$f":"IF(D112=\"\",\"ZZZ9\",IF(AND(#REF!>0,#REF!<5),D112&#REF!,D112&\"9\"))","v":"ZZZ9"},999,999,null,null,999]
[107,null,null,null,null,null,null,null,null,{"$f":"IF(AND(Q113=\"\",#REF!>0,#REF!<5),K113,)","v":{"$error":"#REF!"}},{"$f":"IF(D113=\"\",\"ZZZ9\",IF(AND(#REF!>0,#REF!<5),D113&#REF!,D113&\"9\"))","v":"ZZZ9"},999,999,null,null,999]
[108,null,null,null,null,null,null,null,null,{"$f":"IF(AND(Q114=\"\",#REF!>0,#REF!<5),K114,)","v":{"$error":"#REF!"}},{"$f":"IF(D114=\"\",\"ZZZ9\",IF(AND(#REF!>0,#REF!<5),D114&#REF!,D114&\"9\"))","v":"ZZZ9"},999,999,null,null,999]
[109,null,null,null,null,null,null,null,null,{"$f":"IF(AND(Q115=\"\",#REF!>0,#REF!<5),K115,)","v":{"$error":"#REF!"}},{"$f":"IF(D115=\"\",\"ZZZ9\",IF(AND(#REF!>0,#REF!<5),D115&#REF!,D115&\"9\"))","v":"ZZZ9"},999,999,null,null,999]
[110,null,null,null,null,null,null,null,null,{"$f":"IF(AND(Q116=\"\",#REF!>0,#REF!<5),K116,)","v":{"$error":"#REF!"}},{"$f":"IF(D116=\"\",\"ZZZ9\",IF(AND(#REF!>0,#REF!<5),D116&#REF!,D116&\"9\"))","v":"ZZZ9"},999,999,null,null,999]
[111,null,null,null,null,null,null,null,null,{"$f":"IF(AND(Q117=\"\",#REF!>0,#REF!<5),K117,)","v":{"$error":"#REF!"}},{"$f":"IF(D117=\"\",\"ZZZ9\",IF(AND(#REF!>0,#REF!<5),D117&#REF!,D117&\"9\"))","v":"ZZZ9"},999,999,null,null,999]
[112,null,null,null,null,null,null,null,null,{"$f":"IF(AND(Q118=\"\",#REF!>0,#REF!<5),K118,)","v":{"$error":"#REF!"}},{"$f":"IF(D118=\"\",\"ZZZ9\",IF(AND(#REF!>0,#REF!<5),D118&#REF!,D118&\"9\"))","v":"ZZZ9"},999,999,null,null,999]
[113,null,null,null,null,null,null,null,null,{"$f":"IF(AND(Q119=\"\",#REF!>0,#REF!<5),K119,)","v":{"$error":"#REF!"}},{"$f":"IF(D119=\"\",\"ZZZ9\",IF(AND(#REF!>0,#REF!<5),D119&#REF!,D119&\"9\"))","v":"ZZZ9"},999,999,null,null,999]
[114,null,null,null,null,null,null,null,null,{"$f":"IF(AND(Q120=\"\",#REF!>0,#REF!<5),K120,)","v":{"$error":"#REF!"}},{"$f":"IF(D120=\"\",\"ZZZ9\",IF(AND(#REF!>0,#REF!<5),D120&#REF!,D120&\"9\"))","v":"ZZZ9"},999,999,null,null,999]
[115,null,null,null,null,null,null,null,null,{"$f":"IF(AND(Q121=\"\",#REF!>0,#REF!<5),K121,)","v":{"$error":"#REF!"}},{"$f":"IF(D121=\"\",\"ZZZ9\",IF(AND(#REF!>0,#REF!<5),D121&#REF!,D121&\"9\"))","v":"ZZZ9"},999,999,null,null,999]
[116,null,null,null,null,null,null,null,null,{"$f":"IF(AND(Q122=\"\",#REF!>0,#REF!<5),K122,)","v":{"$error":"#REF!"}},{"$f":"IF(D122=\"\",\"ZZZ9\",IF(AND(#REF!>0,#REF!<5),D122&#REF!,D122&\"9\"))","v":"ZZZ9"},999,999,null,null,999]
[117,null,null,null,null,null,null,null,null,{"$f":"IF(AND(Q123=\"\",#REF!>0,#REF!<5),K123,)","v":{"$error":"#REF!"}},{"$f":"IF(D123=\"\",\"ZZZ9\",IF(AND(#REF!>0,#REF!<5),D123&#REF!,D123&\"9\"))","v":"ZZZ9"},999,999,null,null,999]
[118,null,null,null,null,null,null,null,null,{"$f":"IF(AND(Q124=\"\",#REF!>0,#REF!<5),K124,)","v":{"$error":"#REF!"}},{"$f":"IF(D124=\"\",\"ZZZ9\",IF(AND(#REF!>0,#REF!<5),D124&#REF!,D124&\"9\"))","v":"ZZZ9"},999,999,null,null,999]
[119,null,null,null,null,null,null,null,null,{"$f":"IF(AND(Q125=\"\",#REF!>0,#REF!<5),K125,)","v":{"$error":"#REF!"}},{"$f":"IF(D125=\"\",\"ZZZ9\",IF(AND(#REF!>0,#REF!<5),D125&#REF!,D125&\"9\"))","v":"ZZZ9"},999,999,null,null,999]
[120,null,null,null,null,null,null,null,null,{"$f":"IF(AND(Q126=\"\",#REF!>0,#REF!<5),K126,)","v":{"$error":"#REF!"}},{"$f":"IF(D126=\"\",\"ZZZ9\",IF(AND(#REF!>0,#REF!<5),D126&#REF!,D126&\"9\"))","v":"ZZZ9"},999,999,null,null,999]
[121,null,null,null,null,null,null,null,null,{"$f":"IF(AND(Q127=\"\",#REF!>0,#REF!<5),K127,)","v":{"$error":"#REF!"}},{"$f":"IF(D127=\"\",\"ZZZ9\",IF(AND(#REF!>0,#REF!<5),D127&#REF!,D127&\"9\"))","v":"ZZZ9"},999,999,null,null,999]
[122,null,null,null,null,null,null,null,null,{"$f":"IF(AND(Q128=\"\",#REF!>0,#REF!<5),K128,)","v":{"$error":"#REF!"}},{"$f":"IF(D128=\"\",\"ZZZ9\",IF(AND(#REF!>0,#REF!<5),D128&#REF!,D128&\"9\"))","v":"ZZZ9"},999,999,null,null,999]
[123,null,null,null,null,null,null,null,null,{"$f":"IF(AND(Q129=\"\",#REF!>0,#REF!<5),K129,)","v":{"$error":"#REF!"}},{"$f":"IF(D129=\"\",\"ZZZ9\",IF(AND(#REF!>0,#REF!<5),D129&#REF!,D129&\"9\"))","v":"ZZZ9"},999,999,null,null,999]
[124,null,null,null,null,null,null,null,null,{"$f":"IF(AND(Q130=\"\",#REF!>0,#REF!<5),K130,)","v":{"$error":"#REF!"}},{"$f":"IF(D130=\"\",\"ZZZ9\",IF(AND(#REF!>0,#REF!<5),D130&#REF!,D130&\"9\"))","v":"ZZZ9"},999,999,null,null,999]
[125,null,null,null,null,null,null,null,null,{"$f":"IF(AND(Q131=\"\",#REF!>0,#REF!<5),K131,)","v":{"$error":"#REF!"}},{"$f":"IF(D131=\"\",\"ZZZ9\",IF(AND(#REF!>0,#REF!<5),D131&#REF!,D131&\"9\"))","v":"ZZZ9"},999,999,null,null,999]
[126,null,null,null,null,null,null,null,null,{"$f":"IF(AND(Q132=\"\",#REF!>0,#REF!<5),K132,)","v":{"$error":"#REF!"}},{"$f":"IF(D132=\"\",\"ZZZ9\",IF(AND(#REF!>0,#REF!<5),D132&#REF!,D132&\"9\"))","v":"ZZZ9"},999,999,null,null,999]
[127,null,null,null,null,null,null,null,null,{"$f":"IF(AND(Q133=\"\",#REF!>0,#REF!<5),K133,)","v":{"$error":"#REF!"}},{"$f":"IF(D133=\"\",\"ZZZ9\",IF(AND(#REF!>0,#REF!<5),D133&#REF!,D133&\"9\"))","v":"ZZZ9"},999,999,null,null,999]
[128,null,null,null,null,null,null,null,null,{"$f":"IF(AND(Q134=\"\",#REF!>0,#REF!<5),K134,)","v":{"$error":"#REF!"}},{"$f":"IF(D134=\"\",\"ZZZ9\",IF(AND(#REF!>0,#REF!<5),D134&#REF!,D134&\"9\"))","v":"ZZZ9"},999,999,null,null,999]
[129,null,null,null,null,null,null,null,null,{"$f":"IF(AND(Q135=\"\",#REF!>0,#REF!<5),K135,)","v":{"$error":"#REF!"}},{"$f":"IF(D135=\"\",\"ZZZ9\",IF(AND(#REF!>0,#REF!<5),D135&#REF!,D135&\"9\"))","v":"ZZZ9"},{"$f":"IF(Q135=\"\",999,Q135)","v":999},{"$f":"IF(P135=999,999,1)","v":999},null,null,{"$f":"IF(N135=\"DA\",1,IF(N135=\"WC\",2,IF(N135=\"SE\",3,IF(N135=\"Q\",4,IF(N135=\"LL\",5,999)))))","v":999}]
[130,null,null,null,null,null,null,null,null,{"$f":"IF(AND(Q136=\"\",#REF!>0,#REF!<5),K136,)","v":{"$error":"#REF!"}},{"$f":"IF(D136=\"\",\"ZZZ9\",IF(AND(#REF!>0,#REF!<5),D136&#REF!,D136&\"9\"))","v":"ZZZ9"},999,999,null,null,999]
[131,null,null,null,null,null,null,null,null,{"$f":"IF(AND(Q137=\"\",#REF!>0,#REF!<5),K137,)","v":{"$error":"#REF!"}},{"$f":"IF(D137=\"\",\"ZZZ9\",IF(AND(#REF!>0,#REF!<5),D137&#REF!,D137&\"9\"))","v":"ZZZ9"},999,999,null,null,999]
[132,null,null,null,null,null,null,null,null,{"$f":"IF(AND(Q138=\"\",#REF!>0,#REF!<5),K138,)","v":{"$error":"#REF!"}},{"$f":"IF(D138=\"\",\"ZZZ9\",IF(AND(#REF!>0,#REF!<5),D138&#REF!,D138&\"9\"))","v":"ZZZ9"},999,999,null,null,999]
[133,null,null,null,null,null,null,null,null,{"$f":"IF(AND(Q139=\"\",#REF!>0,#REF!<5),K139,)","v":{"$error":"#REF!"}},{"$f":"IF(D139=\"\",\"ZZZ9\",IF(AND(#REF!>0,#REF!<5),D139&#REF!,D139&\"9\"))","v":"ZZZ9"},999,999,null,null,999]
[134,null,null,null,null,null,null,null,null,{"$f":"IF(AND(Q140=\"\",#REF!>0,#REF!<5),K140,)","v":{"$error":"#REF!"}},{"$f":"IF(D140=\"\",\"ZZZ9\",IF(AND(#REF!>0,#REF!<5),D140&#REF!,D140&\"9\"))","v":"ZZZ9"},999,999,null,null,999]
[135,null,null,null,null,null,null,null,null,{"$f":"IF(AND(Q141=\"\",#REF!>0,#REF!<5),K141,)","v":{"$error":"#REF!"}},{"$f":"IF(D141=\"\",\"ZZZ9\",IF(AND(#REF!>0,#REF!<5),D141&#REF!,D141&\"9\"))","v":"ZZZ9"},999,999,null,null,999]
[136,null,null,null,null,null,null,null,null,{"$f":"IF(AND(Q142=\"\",#REF!>0,#REF!<5),K142,)","v":{"$error":"#REF!"}},{"$f":"IF(D142=\"\",\"ZZZ9\",IF(AND(#REF!>0,#REF!<5),D142&#REF!,D142&\"9\"))","v":"ZZZ9"},999,999,null,null,999]
[137,null,null,null,null,null,null,null,null,{"$f":"IF(AND(Q143=\"\",#REF!>0,#REF!<5),K143,)","v":{"$error":"#REF!"}},{"$f":"IF(D143=\"\",\"ZZZ9\",IF(AND(#REF!>0,#REF!<5),D143&#REF!,D143&\"9\"))","v":"ZZZ9"},999,999,null,null,999]
[138,null,null,null,null,null,null,null,null,{"$f":"IF(AND(Q144=\"\",#REF!>0,#REF!<5),K144,)","v":{"$error":"#REF!"}},{"$f":"IF(D144=\"\",\"ZZZ9\",IF(AND(#REF!>0,#REF!<5),D144&#REF!,D144&\"9\"))","v":"ZZZ9"},999,999,null,null,999]
[139,null,null,null,null,null,null,null,null,{"$f":"IF(AND(Q145=\"\",#REF!>0,#REF!<5),K145,)","v":{"$error":"#REF!"}},{"$f":"IF(D145=\"\",\"ZZZ9\",IF(AND(#REF!>0,#REF!<5),D145&#REF!,D145&\"9\"))","v":"ZZZ9"},999,999,null,null,999]
[140,null,null,null,null,null,null,null,null,{"$f":"IF(AND(Q146=\"\",#REF!>0,#REF!<5),K146,)","v":{"$error":"#REF!"}},{"$f":"IF(D146=\"\",\"ZZZ9\",IF(AND(#REF!>0,#REF!<5),D146&#REF!,D146&\"9\"))","v":"ZZZ9"},999,999,null,null,999]
[141,null,null,null,null,null,null,null,null,{"$f":"IF(AND(Q147=\"\",#REF!>0,#REF!<5),K147,)","v":{"$error":"#REF!"}},{"$f":"IF(D147=\"\",\"ZZZ9\",IF(AND(#REF!>0,#REF!<5),D147&#REF!,D147&\"9\"))","v":"ZZZ9"},999,999,null,null,999]
[142,null,null,null,null,null,null,null,null,{"$f":"IF(AND(Q148=\"\",#REF!>0,#REF!<5),K148,)","v":{"$error":"#REF!"}},{"$f":"IF(D148=\"\",\"ZZZ9\",IF(AND(#REF!>0,#REF!<5),D148&#REF!,D148&\"9\"))","v":"ZZZ9"},999,999,null,null,999]
[143,null,null,null,null,null,null,null,null,{"$f":"IF(AND(Q149=\"\",#REF!>0,#REF!<5),K149,)","v":{"$error":"#REF!"}},{"$f":"IF(D149=\"\",\"ZZZ9\",IF(AND(#REF!>0,#REF!<5),D149&#REF!,D149&\"9\"))","v":"ZZZ9"},999,999,null,null,999]
[144,null,null,null,null,null,null,null,null,{"$f":"IF(AND(Q150=\"\",#REF!>0,#REF!<5),K150,)","v":{"$error":"#REF!"}},{"$f":"IF(D150=\"\",\"ZZZ9\",IF(AND(#REF!>0,#REF!<5),D150&#REF!,D150&\"9\"))","v":"ZZZ9"},999,999,null,null,999]
[145,null,null,null,null,null,null,null,null,{"$f":"IF(AND(Q151=\"\",#REF!>0,#REF!<5),K151,)","v":{"$error":"#REF!"}},{"$f":"IF(D151=\"\",\"ZZZ9\",IF(AND(#REF!>0,#REF!<5),D151&#REF!,D151&\"9\"))","v":"ZZZ9"},999,999,null,null,999]
[146,null,null,null,null,null,null,null,null,{"$f":"IF(AND(Q152=\"\",#REF!>0,#REF!<5),K152,)","v":{"$error":"#REF!"}},{"$f":"IF(D152=\"\",\"ZZZ9\",IF(AND(#REF!>0,#REF!<5),D152&#REF!,D152&\"9\"))","v":"ZZZ9"},999,999,null,null,999]
[147,null,null,null,null,null,null,null,null,{"$f":"IF(AND(Q153=\"\",#REF!>0,#REF!<5),K153,)","v":{"$error":"#REF!"}},{"$f":"IF(D153=\"\",\"ZZZ9\",IF(AND(#REF!>0,#REF!<5),D153&#REF!,D153&\"9\"))","v":"ZZZ9"},999,999,null,null,999]
[148,null,null,null,null,null,null,null,null,{"$f":"IF(AND(Q154=\"\",#REF!>0,#REF!<5),K154,)","v":{"$error":"#REF!"}},{"$f":"IF(D154=\"\",\"ZZZ9\",IF(AND(#REF!>0,#REF!<5),D154&#REF!,D154&\"9\"))","v":"ZZZ9"},999,999,null,null,999]
[149,null,null,null,null,null,null,null,null,{"$f":"IF(AND(Q155=\"\",#REF!>0,#REF!<5),K155,)","v":{"$error":"#REF!"}},{"$f":"IF(D155=\"\",\"ZZZ9\",IF(AND(#REF!>0,#REF!<5),D155&#REF!,D155&\"9\"))","v":"ZZZ9"},999,999,null,null,999]
[150,null,null,null,null,null,null,null,null,{"$f":"IF(AND(Q156=\"\",#REF!>0,#REF!<5),K156,)","v":{"$error":"#REF!"}},{"$f":"IF(D156=\"\",\"ZZZ9\",IF(AND(#REF!>0,#REF!<5),D156&#REF!,D156&\"9\"))","v":"ZZZ9"},999,999,null,null,999]

{"sheet":"1MD 8","index":3,"n_rows":62,"n_cols":34,"rows_kept":62,"cut":false,"hidden":false,"merged":[[3,0,3,2]]}
[{"$f":"Altalanos!$A$6","v":"Diákolimpia Orsz. Döntő"},null,null,null,null,null,null,null,null,null,"Egyéni főtábla",null,null,null,"",null,null,null,null,null,null,null,null,null,null,null,null,{"$f":"IF($Y$5=1,CONCATENATE(VLOOKUP($Y$3,$AA$2:$AH$14,2)),CONCATENATE(VLOOKUP($Y$3,$AA$16:$AH$25,2)))","v":{"$error":"#N/A"}},{"$f":"IF($Y$5=1,CONCATENATE(VLOOKUP($Y$3,$AA$2:$AH$14,3)),CONCATENATE(VLOOKUP($Y$3,$AA$16:$AH$25,3)))","v":{"$error":"#N/A"}},{"$f":"IF($Y$5=1,CONCATENATE(VLOOKUP($Y$3,$AA$2:$AH$14,4)),CONCATENATE(VLOOKUP($Y$3,$AA$16:$AH$25,4)))","v":{"$error":"#N/A"}},{"$f":"IF($Y$5=1,CONCATENATE(VLOOKUP($Y$3,$AA$2:$AH$14,5)),CONCATENATE(VLOOKUP($Y$3,$AA$16:$AH$25,5)))","v":{"$error":"#N/A"}},{"$f":"IF($Y$5=1,CONCATENATE(VLOOKUP($Y$3,$AA$2:$AH$14,6)),CONCATENATE(VLOOKUP($Y$3,$AA$16:$AH$25,6)))","v":{"$error":"#N/A"}},{"$f":"IF($Y$5=1,CONCATENATE(VLOOKUP($Y$3,$AA$2:$AH$14,7)),CONCATENATE(VLOOKUP($Y$3,$AA$16:$AH$25,7)))","v":{"$error":"#N/A"}},{"$f":"IF($Y$5=1,CONCATENATE(VLOOKUP($Y$3,$AA$2:$AH$14,8)),CONCATENATE(VLOOKUP($Y$3,$AA$16:$AH$25,8)))","v":{"$error":"#N/A"}}]
["Versenyszám:",null,null,null,{"$f":"Altalanos!$A$8","v":"Piros lány"},null,null,null,null,null,null,null,null,null,null,null,null,null,null,null,null,null,null,null,null,null,"A",300,250,200,150,120,90,40]
["Dátum",null,null,null,null,null,"Város",null,null,null,"Kategória",null,null,null,null,null,null,"Versenybíró",null,null,null,null,null,null,{"$f":"IF(K4=\"OB\",\"A\",IF(K4=\"IX\",\"W\",IF(K4=\"\",\"\",K4)))","v":""},null,"B",280,230,180,140,80,0,0]
[{"$f":"Altalanos!$A$10","v":"2018.05.28-31."},null,null,null,null,null,{"$f":"Altalanos!$C$10","v":"Balatonboglár"},null,null,null,null,null,null,null,null,null,null,{"$f":"Altalanos!$E$10","v":"Rákóczi Andrea"},null,null,null,null,null,null,null,null,"I",250,200,150,120,90,60,25]
[null,"St.","Rangsor","kód","Kiem","Családi név","Keresztnév",null,"Egyesület",null,"2. forduló",null,"Döntő",null,"Győztes",null,null,null,null,null,null,null,null,null,{"$f":"IF(OR(Altalanos!$A$8=\"F1\",Altalanos!$A$8=\"F2\",Altalanos!$A$8=\"N1\",Altalanos!$A$8=\"N2\"),1,2)","v":2},null,"II",200,150,120,90,60,40,15]
[null,null,null,null,null,{"$f":"IF(Y3=\"\",\"\",CONCATENATE(VLOOKUP(Y3,AB1:AH1,4),\" pont\"))","v":""},null,null,null,null,{"$f":"IF(Y3=\"\",\"\",CONCATENATE(VLOOKUP(Y3,AB1:AH1,3),\" pont\"))","v":""},null,{"$f":"IF(Y3=\"\",\"\",CONCATENATE(VLOOKUP(Y3,AB1:AH1,2),\" pont\"))","v":""},null,{"$f":"IF(Y3=\"\",\"\",CONCATENATE(VLOOKUP(Y3,AB1:AH1,1),\" pont\"))","v":""},null,null,null,null,null,null,null,null,null,null,null,"III",150,120,90,60,40,25,10]
[1,{"$f":"IF($E7=\"\",\"\",VLOOKUP($E7,'piros lány elo'!$A$7:$O$22,14))","v":""},{"$f":"IF($E7=\"\",\"\",VLOOKUP($E7,'piros lány elo'!$A$7:$O$22,15))","v":""},{"$f":"IF($E7=\"\",\"\",VLOOKUP($E7,'piros lány elo'!$A$7:$O$22,5))","v":""},null,{"$f":"UPPER(IF($E7=\"\",\"\",VLOOKUP($E7,'piros lány elo'!$A$7:$O$22,2)))","v":""},{"$f":"IF($E7=\"\",\"\",VLOOKUP($E7,'piros lány elo'!$A$7:$O$22,3))","v":""},null,{"$f":"IF($E7=\"\",\"\",VLOOKUP($E7,'piros lány elo'!$A$7:$O$22,4))","v":""},null,null,null,null,null,null,null,null,null,null,null,{"$f":"Birók!P21","v":"Bíró"},null,null,null,null,null,"IV",120,90,60,40,25,10,5]
[null,null,null,null,null,null,null,null,"Umpire","b",{"$f":"UPPER(IF(OR(J8=\"a\",J8=\"as\"),F7,IF(OR(J8=\"b\",J8=\"bs\"),F9,)))","v":"BENCÉS APÁTSÁG ILLYÉS GYULA ÁLT ÉS ALAPFOKÚ MŰVÉSZETI ISKOLÁJA"},null,null,null,null,null,null,null,null,null,{"$f":"Birók!P22","v":" "},null,null,null,null,null,"V",90,60,40,25,10,5,2]
[2,{"$f":"IF($E9=\"\",\"\",VLOOKUP($E9,'piros lány elo'!$A$7:$O$22,14))","v":0},{"$f":"IF($E9=\"\",\"\",VLOOKUP($E9,'piros lány elo'!$A$7:$O$22,15))","v":0},{"$f":"IF($E9=\"\",\"\",VLOOKUP($E9,'piros lány elo'!$A$7:$O$22,5))","v":0},1,{"$f":"UPPER(IF($E9=\"\",\"\",VLOOKUP($E9,'piros lány elo'!$A$7:$O$22,2)))","v":"BENCÉS APÁTSÁG ILLYÉS GYULA ÁLT ÉS ALAPFOKÚ MŰVÉSZETI ISKOLÁJA"},{"$f":"IF($E9=\"\",\"\",VLOOKUP($E9,'piros lány elo'!$A$7:$O$22,3))","v":0},null,{"$f":"IF($E9=\"\",\"\",VLOOKUP($E9,'piros lány elo'!$A$7:$O$22,4))","v":"Tihany"},null,null,null,null,null,null,null,null,null,null,null,{"$f":"Birók!P23","v":" "},null,null,null,null,null,"VI",60,40,25,10,5,2,1]
[null,null,null,null,null,null,null,null,null,null,"Umpire","a",{"$f":"UPPER(IF(OR(L10=\"a\",L10=\"as\"),K8,IF(OR(L10=\"b\",L10=\"bs\"),K12,)))","v":"BENCÉS APÁTSÁG ILLYÉS GYULA ÁLT ÉS ALAPFOKÚ MŰVÉSZETI ISKOLÁJA"},null,null,null,null,null,null,null,{"$f":"Birók!P24","v":" "},null,null,null,null,null,"VII",40,25,15,7,4,1,0]
[3,{"$f":"IF($E11=\"\",\"\",VLOOKUP($E11,'piros lány elo'!$A$7:$O$22,14))","v":0},{"$f":"IF($E11=\"\",\"\",VLOOKUP($E11,'piros lány elo'!$A$7:$O$22,15))","v":0},{"$f":"IF($E11=\"\",\"\",VLOOKUP($E11,'piros lány elo'!$A$7:$O$22,5))","v":0},11,{"$f":"UPPER(IF($E11=\"\",\"\",VLOOKUP($E11,'piros lány elo'!$A$7:$O$22,2)))","v":"SOPRONKÖVESDI ÁLTALÁNOS ISKOLA"},{"$f":"IF($E11=\"\",\"\",VLOOKUP($E11,'piros lány elo'!$A$7:$O$22,3))","v":0},null,{"$f":"IF($E11=\"\",\"\",VLOOKUP($E11,'piros lány elo'!$A$7:$O$22,4))","v":"Sopronkövesd"},null,null,null,"2/0",null,null,null,null,null,null,null,{"$f":"Birók!P25","v":" "},null,null,null,null,null,"VIII",25,15,10,6,3,1,0]
[null,null,null,null,null,null,null,null,"Umpire","a",{"$f":"UPPER(IF(OR(J12=\"a\",J12=\"as\"),F11,IF(OR(J12=\"b\",J12=\"bs\"),F13,)))","v":"SOPRONKÖVESDI ÁLTALÁNOS ISKOLA"},null,null,null,null,null,null,null,null,null,{"$f":"Birók!P26","v":" "},null,null,null,null,null,"W",15,10,6,3,1,0,0]
[4,{"$f":"IF($E13=\"\",\"\",VLOOKUP($E13,'piros lány elo'!$A$7:$O$22,14))","v":""},{"$f":"IF($E13=\"\",\"\",VLOOKUP($E13,'piros lány elo'!$A$7:$O$22,15))","v":""},{"$f":"IF($E13=\"\",\"\",VLOOKUP($E13,'piros lány elo'!$A$7:$O$22,5))","v":""},null,{"$f":"UPPER(IF($E13=\"\",\"\",VLOOKUP($E13,'piros lány elo'!$A$7:$O$22,2)))","v":""},{"$f":"IF($E13=\"\",\"\",VLOOKUP($E13,'piros lány elo'!$A$7:$O$22,3))","v":""},null,{"$f":"IF($E13=\"\",\"\",VLOOKUP($E13,'piros lány elo'!$A$7:$O$22,4))","v":""},null,null,null,null,null,null,null,null,null,null,null,{"$f":"Birók!P27","v":" "},null,null,null,null,null,"X",10,6,3,1,0,0,0]
[null,null,null,null,null,null,null,null,null,null,null,null,"Umpire","a",{"$f":"UPPER(IF(OR(N14=\"a\",N14=\"as\"),M10,IF(OR(N14=\"b\",N14=\"bs\"),M18,)))","v":"BENCÉS APÁTSÁG ILLYÉS GYULA ÁLT ÉS ALAPFOKÚ MŰVÉSZETI ISKOLÁJA"},null,null,null,null,null,{"$f":"Birók!P28","v":" "},null,null,null,null,null,"XI",3,2,1,0,0,0,0]
[5,{"$f":"IF($E15=\"\",\"\",VLOOKUP($E15,'piros lány elo'!$A$7:$O$22,14))","v":""},{"$f":"IF($E15=\"\",\"\",VLOOKUP($E15,'piros lány elo'!$A$7:$O$22,15))","v":""},{"$f":"IF($E15=\"\",\"\",VLOOKUP($E15,'piros lány elo'!$A$7:$O$22,5))","v":""},null,{"$f":"UPPER(IF($E15=\"\",\"\",VLOOKUP($E15,'piros lány elo'!$A$7:$O$22,2)))","v":""},{"$f":"IF($E15=\"\",\"\",VLOOKUP($E15,'piros lány elo'!$A$7:$O$22,3))","v":""},null,{"$f":"IF($E15=\"\",\"\",VLOOKUP($E15,'piros lány elo'!$A$7:$O$22,4))","v":""},null,null,null,null,null,"20/17",null,null,null,null,null,{"$f":"Birók!P29","v":" "}]
[null,null,null,null,null,null,null,null,"Umpire",null,{"$f":"UPPER(IF(OR(J16=\"a\",J16=\"as\"),F15,IF(OR(J16=\"b\",J16=\"bs\"),F17,)))","v":""},null,null,null,null,null,null,null,null,null,{"$f":"Birók!P30","v":"Egyik sem"},null,null,null,null,null,"A",150,120,90,60,40,25,15]
[6,{"$f":"IF($E17=\"\",\"\",VLOOKUP($E17,'piros lány elo'!$A$7:$O$22,14))","v":""},{"$f":"IF($E17=\"\",\"\",VLOOKUP($E17,'piros lány elo'!$A$7:$O$22,15))","v":""},{"$f":"IF($E17=\"\",\"\",VLOOKUP($E17,'piros lány elo'!$A$7:$O$22,5))","v":""},null,{"$f":"UPPER(IF($E17=\"\",\"\",VLOOKUP($E17,'piros lány elo'!$A$7:$O$22,2)))","v":""},{"$f":"IF($E17=\"\",\"\",VLOOKUP($E17,'piros lány elo'!$A$7:$O$22,3))","v":""},null,{"$f":"IF($E17=\"\",\"\",VLOOKUP($E17,'piros lány elo'!$A$7:$O$22,4))","v":""},null,null,null,null,null,null,null,null,null,null,null,null,null,null,null,null,null,"I",120,90,60,40,25,15,8]
[null,null,null,null,null,null,null,null,null,null,"Umpire","b",{"$f":"UPPER(IF(OR(L18=\"a\",L18=\"as\"),K16,IF(OR(L18=\"b\",L18=\"bs\"),K20,)))","v":"BOGLÁRI ÁLTALÁNOS ISKOLA ÉS ALAPFOKÚ MŰVÉSZETI ISKOLA"},null,null,null,null,null,null,null,null,null,null,null,null,null,"II",90,60,40,25,15,8,4]
[7,{"$f":"IF($E19=\"\",\"\",VLOOKUP($E19,'piros lány elo'!$A$7:$O$22,14))","v":0},{"$f":"IF($E19=\"\",\"\",VLOOKUP($E19,'piros lány elo'!$A$7:$O$22,15))","v":0},{"$f":"IF($E19=\"\",\"\",VLOOKUP($E19,'piros lány elo'!$A$7:$O$22,5))","v":0},2,{"$f":"UPPER(IF($E19=\"\",\"\",VLOOKUP($E19,'piros lány elo'!$A$7:$O$22,2)))","v":"BOGLÁRI ÁLTALÁNOS ISKOLA ÉS ALAPFOKÚ MŰVÉSZETI ISKOLA"},{"$f":"IF($E19=\"\",\"\",VLOOKUP($E19,'piros lány elo'!$A$7:$O$22,3))","v":0},null,{"$f":"IF($E19=\"\",\"\",VLOOKUP($E19,'piros lány elo'!$A$7:$O$22,4))","v":"Balatonboglár"},null,null,null,null,null,null,null,null,null,null,null,null,null,null,null,null,null,"III",60,40,25,15,8,4,2]
[null,null,null,null,null,null,null,null,"Umpire","a",{"$f":"UPPER(IF(OR(J20=\"a\",J20=\"as\"),F19,IF(OR(J20=\"b\",J20=\"bs\"),F21,)))","v":"BOGLÁRI ÁLTALÁNOS ISKOLA ÉS ALAPFOKÚ MŰVÉSZETI ISKOLA"},null,null,null,null,null,null,null,null,null,null,null,null,null,null,null,"IV",40,25,15,8,4,2,1]
[8,{"$f":"IF($E21=\"\",\"\",VLOOKUP($E21,'piros lány elo'!$A$7:$O$22,14))","v":""},{"$f":"IF($E21=\"\",\"\",VLOOKUP($E21,'piros lány elo'!$A$7:$O$22,15))","v":""},{"$f":"IF($E21=\"\",\"\",VLOOKUP($E21,'piros lány elo'!$A$7:$O$22,5))","v":""},null,{"$f":"UPPER(IF($E21=\"\",\"\",VLOOKUP($E21,'piros lány elo'!$A$7:$O$22,2)))","v":""},{"$f":"IF($E21=\"\",\"\",VLOOKUP($E21,'piros lány elo'!$A$7:$O$22,3))","v":""},null,{"$f":"IF($E21=\"\",\"\",VLOOKUP($E21,'piros lány elo'!$A$7:$O$22,4))","v":""},null,null,null,null,null,null,null,null,null,null,null,null,null,null,null,null,null,"V",25,15,10,6,3,1,0]
[null,null,null,null,null,null,null,null,null,null,null,null,null,null,null,null,null,null,null,null,null,null,null,null,null,null,"VI",15,10,6,3,1,0,0]
[null,null,null,null,null,null,null,null,null,null,null,null,null,null,null,null,null,null,null,null,null,null,null,null,null,null,"VII",10,6,3,1,0,0,0]
[null,null,null,null,null,null,null,null,null,null,null,null,null,null,null,null,null,null,null,null,null,null,null,null,null,null,"VIII",6,3,1,0,0,0,0]
[null,null,null,null,null,null,null,null,null,null,null,null,null,null,null,null,null,null,null,null,null,null,null,null,null,null,"W",3,2,1,0,0,0,0]
[]
[]
[]
[]
[]
[]
[]
[]
[]
[]
[]
[]
[]
[]
[]
[]
[]
[]
[]
[]
[]
[]
[]
[]
[]
[]
[]
[]
["Rangsor",null,null,null,"#","Kiemeltek",null,null,null,"#","Szerencés Vesztes",null,"Helyettesíti",null,"Sorsolás időpontja"]
["Dátuma",null,null,null,1,{"$f":"IF(E55>$R$62,,UPPER(VLOOKUP(E55,'piros lány elo'!$A$7:$Q$134,2)))","v":"BENCÉS APÁTSÁG ILLYÉS GYULA ÁLT ÉS ALAPFOKÚ MŰVÉSZETI ISKOLÁJA"},null,null,null,"1",null,null,null,null,"Utolsó elfogadott játékos"]
["Utolsó DA",null,null,null,2,{"$f":"IF(E56>$R$62,,UPPER(VLOOKUP(E56,'piros lány elo'!$A$7:$Q$134,2)))","v":"BOGLÁRI ÁLTALÁNOS ISKOLA ÉS ALAPFOKÚ MŰVÉSZETI ISKOLA"},null,null,null,"2"]
[null,null,null,null,null,null,null,null,null,"3",null,null,null,null,"Sorsoló játékosok"]
[null,null,null,null,null,null,null,null,null,"4"]
[null,null,null,null,null,null,null,null,null,"5"]
[null,null,null,null,null,null,null,null,null,"6",null,null,null,null,"Versenybíró aláírása"]
[null,null,null,null,null,null,null,null,null,"7"]
[null,null,null,null,null,null,null,null,null,"8",null,null,null,null,{"$f":"R4","v":"Rákóczi Andrea"},null,null,{"$f":"MIN(4,'piros lány elo'!Q5)","v":4}]

{"sheet":"1MD 16","index":4,"n_rows":57,"n_cols":34,"rows_kept":57,"cut":false,"hidden":false,"merged":[[3,0,3,2]]}
[{"$f":"Altalanos!$A$6","v":"Diákolimpia Orsz. Döntő"},null,null,null,null,null,null,null,null,null,"Egyéni főtábla",null,null,null,"CU",null,null,null,null,null,null,null,null,null,null,null,null,{"$f":"IF($Y$5=1,CONCATENATE(VLOOKUP($Y$3,$AA$2:$AH$14,2)),CONCATENATE(VLOOKUP($Y$3,$AA$16:$AH$25,2)))","v":{"$error":"#N/A"}},{"$f":"IF($Y$5=1,CONCATENATE(VLOOKUP($Y$3,$AA$2:$AH$14,3)),CONCATENATE(VLOOKUP($Y$3,$AA$16:$AH$25,3)))","v":{"$error":"#N/A"}},{"$f":"IF($Y$5=1,CONCATENATE(VLOOKUP($Y$3,$AA$2:$AH$14,4)),CONCATENATE(VLOOKUP($Y$3,$AA$16:$AH$25,4)))","v":{"$error":"#N/A"}},{"$f":"IF($Y$5=1,CONCATENATE(VLOOKUP($Y$3,$AA$2:$AH$14,5)),CONCATENATE(VLOOKUP($Y$3,$AA$16:$AH$25,5)))","v":{"$error":"#N/A"}},{"$f":"IF($Y$5=1,CONCATENATE(VLOOKUP($Y$3,$AA$2:$AH$14,6)),CONCATENATE(VLOOKUP($Y$3,$AA$16:$AH$25,6)))","v":{"$error":"#N/A"}},{"$f":"IF($Y$5=1,CONCATENATE(VLOOKUP($Y$3,$AA$2:$AH$14,7)),CONCATENATE(VLOOKUP($Y$3,$AA$16:$AH$25,7)))","v":{"$error":"#N/A"}},{"$f":"IF($Y$5=1,CONCATENATE(VLOOKUP($Y$3,$AA$2:$AH$14,8)),CONCATENATE(VLOOKUP($Y$3,$AA$16:$AH$25,8)))","v":{"$error":"#N/A"}}]
["Versenyszám:",null,null,null,{"$f":"Altalanos!$A$8","v":"Piros lány"},null,null,null,null,null,null,null,null,null,null,null,null,null,null,null,null,null,null,null,null,null,"A",300,250,200,150,120,90,40]
["Dátum",null,null,null,null,null,"Város",null,null,null,"Kategória",null,null,null,null,null,null,"Versenybíró",null,null,null,null,null,null,{"$f":"IF(K4=\"OB\",\"A\",IF(K4=\"IX\",\"W\",IF(K4=\"\",\"\",K4)))","v":""},null,"B",280,230,180,140,80,0,0]
[{"$f":"Altalanos!$A$10","v":"2018.05.28-31."},null,null,null,null,null,{"$f":"Altalanos!$C$10","v":"Balatonboglár"},null,null,null,null,null,null,null,null,null,null,{"$f":"Altalanos!$E$10","v":"Rákóczi Andrea"},null,null,null,null,null,null,null,null,"I",250,200,150,120,90,60,25]
[null,"St.","Rangsor","kód","Kiem","Családi név","Keresztnév",null,"Egyesület",null,"2. forduló",null,"Elődöntők",null,"Döntő",null,"Győztes",null,null,null,null,null,null,null,{"$f":"IF(OR(Altalanos!$A$8=\"F1\",Altalanos!$A$8=\"F2\",Altalanos!$A$8=\"N1\",Altalanos!$A$8=\"N2\"),1,2)","v":2},null,"II",200,150,120,90,60,40,15]
[null,null,null,null,null,{"$f":"IF(Y3=\"\",\"\",CONCATENATE(AH1,\" / \",VLOOKUP(Y3,AB1:AH1,5),\" pont\"))","v":""},null,null,null,null,{"$f":"IF(Y3=\"\",\"\",CONCATENATE(VLOOKUP(Y3,AB1:AH1,4),\" pont\"))","v":""},null,{"$f":"IF(Y3=\"\",\"\",CONCATENATE(VLOOKUP(Y3,AB1:AH1,3),\" pont\"))","v":""},null,{"$f":"IF(Y3=\"\",\"\",CONCATENATE(VLOOKUP(Y3,AB1:AH1,2),\" pont\"))","v":""},null,{"$f":"IF(Y3=\"\",\"\",CONCATENATE(VLOOKUP(Y3,AB1:AH1,1),\" pont\"))","v":""},null,null,null,null,null,null,null,null,null,"III",150,120,90,60,40,25,10]
[1,{"$f":"IF($E7=\"\",\"\",VLOOKUP($E7,'piros lány elo'!$A$7:$O$22,14))","v":0},{"$f":"IF($E7=\"\",\"\",VLOOKUP($E7,'piros lány elo'!$A$7:$O$22,15))","v":0},{"$f":"IF($E7=\"\",\"\",VLOOKUP($E7,'piros lány elo'!$A$7:$O$22,5))","v":0},1,{"$f":"UPPER(IF($E7=\"\",\"\",VLOOKUP($E7,'piros lány elo'!$A$7:$O$22,2)))","v":"BENCÉS APÁTSÁG ILLYÉS GYULA ÁLT ÉS ALAPFOKÚ MŰVÉSZETI ISKOLÁJA"},{"$f":"IF($E7=\"\",\"\",VLOOKUP($E7,'piros lány elo'!$A$7:$O$22,3))","v":0},null,{"$f":"IF($E7=\"\",\"\",VLOOKUP($E7,'piros lány elo'!$A$7:$O$22,4))","v":"Tihany"},null,null,null,null,null,null,null,null,null,null,null,{"$f":"Birók!P21","v":"Bíró"},null,null,null,null,null,"IV",120,90,60,40,25,10,5]
[null,null,null,null,null,null,null,null,"Umpire","as",{"$f":"UPPER(IF(OR(J8=\"a\",J8=\"as\"),F7,IF(OR(J8=\"b\",J8=\"bs\"),F9,)))","v":"BENCÉS APÁTSÁG ILLYÉS GYULA ÁLT ÉS ALAPFOKÚ MŰVÉSZETI ISKOLÁJA"},null,null,null,null,null,null,null,null,null,{"$f":"Birók!P22","v":" "},null,null,null,null,null,"V",90,60,40,25,10,5,2]
[2,{"$f":"IF($E9=\"\",\"\",VLOOKUP($E9,'piros lány elo'!$A$7:$O$22,14))","v":""},{"$f":"IF($E9=\"\",\"\",VLOOKUP($E9,'piros lány elo'!$A$7:$O$22,15))","v":""},{"$f":"IF($E9=\"\",\"\",VLOOKUP($E9,'piros lány elo'!$A$7:$O$22,5))","v":""},null,"x",{"$f":"IF($E9=\"\",\"\",VLOOKUP($E9,'piros lány elo'!$A$7:$O$22,3))","v":""},null,{"$f":"IF($E9=\"\",\"\",VLOOKUP($E9,'piros lány elo'!$A$7:$O$22,4))","v":""},null,null,null,null,null,null,null,null,null,null,null,{"$f":"Birók!P23","v":" "},null,null,null,null,null,"VI",60,40,25,10,5,2,1]
[null,null,null,null,null,null,null,null,null,null,"Umpire","b",{"$f":"UPPER(IF(OR(L10=\"a\",L10=\"as\"),K8,IF(OR(L10=\"b\",L10=\"bs\"),K12,)))","v":"KISKUNFÉLEGYHÁZI JÓZSEF ATTILA ÁLTALÁNOS ISKOLA"},null,null,null,null,null,null,null,{"$f":"Birók!P24","v":" "},null,null,null,null,null,"VII",40,25,15,7,4,1,0]
[3,{"$f":"IF($E11=\"\",\"\",VLOOKUP($E11,'piros lány elo'!$A$7:$O$22,14))","v":0},{"$f":"IF($E11=\"\",\"\",VLOOKUP($E11,'piros lány elo'!$A$7:$O$22,15))","v":0},{"$f":"IF($E11=\"\",\"\",VLOOKUP($E11,'piros lány elo'!$A$7:$O$22,5))","v":0},8,{"$f":"UPPER(IF($E11=\"\",\"\",VLOOKUP($E11,'piros lány elo'!$A$7:$O$22,2)))","v":"PÉCSI BÁRTFA UTCAI ÁLTALÁNOS ISKOLA A"},"A",null,{"$f":"IF($E11=\"\",\"\",VLOOKUP($E11,'piros lány elo'!$A$7:$O$22,4))","v":"Pécs"},null,null,null,"2/0",null,null,null,null,null,null,null,{"$f":"Birók!P25","v":" "},null,null,null,null,null,"VIII",25,15,10,6,3,1,0]
[null,null,null,null,null,null,null,null,"Umpire","b",{"$f":"UPPER(IF(OR(J12=\"a\",J12=\"as\"),F11,IF(OR(J12=\"b\",J12=\"bs\"),F13,)))","v":"KISKUNFÉLEGYHÁZI JÓZSEF ATTILA ÁLTALÁNOS ISKOLA"},null,null,null,null,null,null,null,null,null,{"$f":"Birók!P26","v":" "},null,null,null,null,null,"W",15,10,6,3,1,0,0]
[4,{"$f":"IF($E13=\"\",\"\",VLOOKUP($E13,'piros lány elo'!$A$7:$O$22,14))","v":0},{"$f":"IF($E13=\"\",\"\",VLOOKUP($E13,'piros lány elo'!$A$7:$O$22,15))","v":0},{"$f":"IF($E13=\"\",\"\",VLOOKUP($E13,'piros lány elo'!$A$7:$O$22,5))","v":0},6,{"$f":"UPPER(IF($E13=\"\",\"\",VLOOKUP($E13,'piros lány elo'!$A$7:$O$22,2)))","v":"KISKUNFÉLEGYHÁZI JÓZSEF ATTILA ÁLTALÁNOS ISKOLA"},{"$f":"IF($E13=\"\",\"\",VLOOKUP($E13,'piros lány elo'!$A$7:$O$22,3))","v":0},null,{"$f":"IF($E13=\"\",\"\",VLOOKUP($E13,'piros lány elo'!$A$7:$O$22,4))","v":"Kiskunfélegyháza"},null,"2/0",null,null,null,null,null,null,null,null,null,{"$f":"Birók!P27","v":" "},null,null,null,null,null,"X",10,6,3,1,0,0,0]
[null,null,null,null,null,null,null,null,null,null,null,null,"Umpire","a",{"$f":"UPPER(IF(OR(N14=\"a\",N14=\"as\"),M10,IF(OR(N14=\"b\",N14=\"bs\"),M18,)))","v":"KISKUNFÉLEGYHÁZI JÓZSEF ATTILA ÁLTALÁNOS ISKOLA"},null,null,null,null,null,{"$f":"Birók!P28","v":" "},null,null,null,null,null,"XI",3,2,1,0,0,0,0]
[5,{"$f":"IF($E15=\"\",\"\",VLOOKUP($E15,'piros lány elo'!$A$7:$O$22,14))","v":0},{"$f":"IF($E15=\"\",\"\",VLOOKUP($E15,'piros lány elo'!$A$7:$O$22,15))","v":0},{"$f":"IF($E15=\"\",\"\",VLOOKUP($E15,'piros lány elo'!$A$7:$O$22,5))","v":0},3,{"$f":"UPPER(IF($E15=\"\",\"\",VLOOKUP($E15,'piros lány elo'!$A$7:$O$22,2)))","v":"DIÓSGYŐRI NAGY LAJOS KIRÁLY ÁLTALÁNOS ISKOLA A"},{"$f":"IF($E15=\"\",\"\",VLOOKUP($E15,'piros lány elo'!$A$7:$O$22,3))","v":0},null,{"$f":"IF($E15=\"\",\"\",VLOOKUP($E15,'piros lány elo'!$A$7:$O$22,4))","v":"Miskolc"},null,null,null,null,null,"2/0",null,null,null,null,null,{"$f":"Birók!P29","v":" "}]
[null,null,null,null,null,null,null,null,"Umpire","as",{"$f":"UPPER(IF(OR(J16=\"a\",J16=\"as\"),F15,IF(OR(J16=\"b\",J16=\"bs\"),F17,)))","v":"DIÓSGYŐRI NAGY LAJOS KIRÁLY ÁLTALÁNOS ISKOLA A"},null,null,null,null,null,null,null,null,null,{"$f":"Birók!P30","v":"Egyik sem"},null,null,null,null,null,"A",150,120,90,60,40,25,15]
[6,{"$f":"IF($E17=\"\",\"\",VLOOKUP($E17,'piros lány elo'!$A$7:$O$22,14))","v":0},{"$f":"IF($E17=\"\",\"\",VLOOKUP($E17,'piros lány elo'!$A$7:$O$22,15))","v":0},{"$f":"IF($E17=\"\",\"\",VLOOKUP($E17,'piros lány elo'!$A$7:$O$22,5))","v":0},12,"x",{"$f":"IF($E17=\"\",\"\",VLOOKUP($E17,'piros lány elo'!$A$7:$O$22,3))","v":0},null,{"$f":"IF($E17=\"\",\"\",VLOOKUP($E17,'piros lány elo'!$A$7:$O$22,4))","v":0},null,null,null,null,null,null,null,null,null,null,null,null,null,null,null,null,null,"I",120,90,60,40,25,15,8]
[null,null,null,null,null,null,null,null,null,null,"Umpire","as",{"$f":"UPPER(IF(OR(L18=\"a\",L18=\"as\"),K16,IF(OR(L18=\"b\",L18=\"bs\"),K20,)))","v":"DIÓSGYŐRI NAGY LAJOS KIRÁLY ÁLTALÁNOS ISKOLA A"},null,null,null,null,null,null,null,null,null,null,null,null,null,"II",90,60,40,25,15,8,4]
[7,{"$f":"IF($E19=\"\",\"\",VLOOKUP($E19,'piros lány elo'!$A$7:$O$22,14))","v":0},{"$f":"IF($E19=\"\",\"\",VLOOKUP($E19,'piros lány elo'!$A$7:$O$22,15))","v":0},{"$f":"IF($E19=\"\",\"\",VLOOKUP($E19,'piros lány elo'!$A$7:$O$22,5))","v":0},9,{"$f":"UPPER(IF($E19=\"\",\"\",VLOOKUP($E19,'piros lány elo'!$A$7:$O$22,2)))","v":"PÉCSI BÁRTFA UTCAI ÁLTALÁNOS ISKOLA B"},"B",null,{"$f":"IF($E19=\"\",\"\",VLOOKUP($E19,'piros lány elo'!$A$7:$O$22,4))","v":"Pécs"},null,null,null,"28/18",null,null,null,null,null,null,null,null,null,null,null,null,null,"III",60,40,25,15,8,4,2]
[null,null,null,null,null,null,null,null,"Umpire","a",{"$f":"UPPER(IF(OR(J20=\"a\",J20=\"as\"),F19,IF(OR(J20=\"b\",J20=\"bs\"),F21,)))","v":"PÉCSI BÁRTFA UTCAI ÁLTALÁNOS ISKOLA B"},null,null,null,null,null,null,null,null,null,null,null,null,null,null,null,"IV",40,25,15,8,4,2,1]
[8,{"$f":"IF($E21=\"\",\"\",VLOOKUP($E21,'piros lány elo'!$A$7:$O$22,14))","v":""},{"$f":"IF($E21=\"\",\"\",VLOOKUP($E21,'piros lány elo'!$A$7:$O$22,15))","v":""},{"$f":"IF($E21=\"\",\"\",VLOOKUP($E21,'piros lány elo'!$A$7:$O$22,5))","v":""},null,"x",{"$f":"IF($E21=\"\",\"\",VLOOKUP($E21,'piros lány elo'!$A$7:$O$22,3))","v":""},null,{"$f":"IF($E21=\"\",\"\",VLOOKUP($E21,'piros lány elo'!$A$7:$O$22,4))","v":""},null,null,null,null,null,null,null,null,null,null,null,null,null,null,null,null,null,"V",25,15,10,6,3,1,0]
[null,null,null,null,null,null,null,null,null,null,null,null,null,null,"Umpire","a",{"$f":"UPPER(IF(OR(P22=\"a\",P22=\"as\"),O14,IF(OR(P22=\"b\",P22=\"bs\"),O30,)))","v":"KISKUNFÉLEGYHÁZI JÓZSEF ATTILA ÁLTALÁNOS ISKOLA"},null,null,null,null,null,null,null,null,null,"VI",15,10,6,3,1,0,0]
[9,{"$f":"IF($E23=\"\",\"\",VLOOKUP($E23,'piros lány elo'!$A$7:$O$22,14))","v":0},{"$f":"IF($E23=\"\",\"\",VLOOKUP($E23,'piros lány elo'!$A$7:$O$22,15))","v":0},{"$f":"IF($E23=\"\",\"\",VLOOKUP($E23,'piros lány elo'!$A$7:$O$22,5))","v":0},5,{"$f":"UPPER(IF($E23=\"\",\"\",VLOOKUP($E23,'piros lány elo'!$A$7:$O$22,2)))","v":"KAZINCBARCIKAI POLLACK MIHÁLY ÁLTALÁNOS ISKOLA"},{"$f":"IF($E23=\"\",\"\",VLOOKUP($E23,'piros lány elo'!$A$7:$O$22,3))","v":0},null,{"$f":"IF($E23=\"\",\"\",VLOOKUP($E23,'piros lány elo'!$A$7:$O$22,4))","v":"Kazincbarcika"},null,null,null,null,null,null,null,"2/0",null,null,null,null,null,null,null,null,null,"VII",10,6,3,1,0,0,0]
[null,null,null,null,null,null,null,null,"Umpire","a",{"$f":"UPPER(IF(OR(J24=\"a\",J24=\"as\"),F23,IF(OR(J24=\"b\",J24=\"bs\"),F25,)))","v":"KAZINCBARCIKAI POLLACK MIHÁLY ÁLTALÁNOS ISKOLA"},null,null,null,null,null,null,null,null,null,null,null,null,null,null,null,"VIII",6,3,1,0,0,0,0]
[10,{"$f":"IF($E25=\"\",\"\",VLOOKUP($E25,'piros lány elo'!$A$7:$O$22,14))","v":0},{"$f":"IF($E25=\"\",\"\",VLOOKUP($E25,'piros lány elo'!$A$7:$O$22,15))","v":0},{"$f":"IF($E25=\"\",\"\",VLOOKUP($E25,'piros lány elo'!$A$7:$O$22,5))","v":0},13,{"$f":"UPPER(IF($E25=\"\",\"\",VLOOKUP($E25,'piros lány elo'!$A$7:$O$22,2)))","v":""},{"$f":"IF($E25=\"\",\"\",VLOOKUP($E25,'piros lány elo'!$A$7:$O$22,3))","v":0},null,{"$f":"IF($E25=\"\",\"\",VLOOKUP($E25,'piros lány elo'!$A$7:$O$22,4))","v":0},null,null,null,null,null,null,null,null,null,null,null,null,null,null,null,null,null,"W",3,2,1,0,0,0,0]
[null,null,null,null,null,null,null,null,null,null,"Umpire","a",{"$f":"UPPER(IF(OR(L26=\"a\",L26=\"as\"),K24,IF(OR(L26=\"b\",L26=\"bs\"),K28,)))","v":"KAZINCBARCIKAI POLLACK MIHÁLY ÁLTALÁNOS ISKOLA"}]
[11,{"$f":"IF($E27=\"\",\"\",VLOOKUP($E27,'piros lány elo'!$A$7:$O$22,14))","v":0},{"$f":"IF($E27=\"\",\"\",VLOOKUP($E27,'piros lány elo'!$A$7:$O$22,15))","v":0},{"$f":"IF($E27=\"\",\"\",VLOOKUP($E27,'piros lány elo'!$A$7:$O$22,5))","v":0},11,"SOPRONKÖVESDI Álr.Isk.",{"$f":"IF($E27=\"\",\"\",VLOOKUP($E27,'piros lány elo'!$A$7:$O$22,3))","v":0},null,{"$f":"IF($E27=\"\",\"\",VLOOKUP($E27,'piros lány elo'!$A$7:$O$22,4))","v":"Sopronkövesd"},null,null,null,"31/26"]
[null,null,null,null,null,null,null,null,"Umpire","a",{"$f":"UPPER(IF(OR(J28=\"a\",J28=\"as\"),F27,IF(OR(J28=\"b\",J28=\"bs\"),F29,)))","v":"SOPRONKÖVESDI ÁLR.ISK."}]
[12,{"$f":"IF($E29=\"\",\"\",VLOOKUP($E29,'piros lány elo'!$A$7:$O$22,14))","v":0},{"$f":"IF($E29=\"\",\"\",VLOOKUP($E29,'piros lány elo'!$A$7:$O$22,15))","v":0},{"$f":"IF($E29=\"\",\"\",VLOOKUP($E29,'piros lány elo'!$A$7:$O$22,5))","v":0},13,{"$f":"UPPER(IF($E29=\"\",\"\",VLOOKUP($E29,'piros lány elo'!$A$7:$O$22,2)))","v":""},{"$f":"IF($E29=\"\",\"\",VLOOKUP($E29,'piros lány elo'!$A$7:$O$22,3))","v":0},null,{"$f":"IF($E29=\"\",\"\",VLOOKUP($E29,'piros lány elo'!$A$7:$O$22,4))","v":0}]
[null,null,null,null,null,null,null,null,null,null,null,null,"Umpire","b",{"$f":"UPPER(IF(OR(N30=\"a\",N30=\"as\"),M26,IF(OR(N30=\"b\",N30=\"bs\"),M34,)))","v":"PARAGVARI"}]
[13,{"$f":"IF($E31=\"\",\"\",VLOOKUP($E31,'piros lány elo'!$A$7:$O$22,14))","v":0},{"$f":"IF($E31=\"\",\"\",VLOOKUP($E31,'piros lány elo'!$A$7:$O$22,15))","v":0},{"$f":"IF($E31=\"\",\"\",VLOOKUP($E31,'piros lány elo'!$A$7:$O$22,5))","v":0},10,{"$f":"UPPER(IF($E31=\"\",\"\",VLOOKUP($E31,'piros lány elo'!$A$7:$O$22,2)))","v":"SZENT II. JÁNOS PÁL ÓVODA, ÁLTALÁNOS ISKOLA ÉS GIMNÁZIUM, BP."},{"$f":"IF($E31=\"\",\"\",VLOOKUP($E31,'piros lány elo'!$A$7:$O$22,3))","v":0},null,{"$f":"IF($E31=\"\",\"\",VLOOKUP($E31,'piros lány elo'!$A$7:$O$22,4))","v":"Budapest"},null,null,null,null,null,"2/0"]
[null,null,null,null,null,null,null,null,"Umpire","b","PARAGVARI"]
[14,{"$f":"IF($E33=\"\",\"\",VLOOKUP($E33,'piros lány elo'!$A$7:$O$22,14))","v":0},{"$f":"IF($E33=\"\",\"\",VLOOKUP($E33,'piros lány elo'!$A$7:$O$22,15))","v":0},{"$f":"IF($E33=\"\",\"\",VLOOKUP($E33,'piros lány elo'!$A$7:$O$22,5))","v":0},7,{"$f":"UPPER(IF($E33=\"\",\"\",VLOOKUP($E33,'piros lány elo'!$A$7:$O$22,2)))","v":"PARAGVÁRI UTCAI ÁLTALÁNOS ISKOLA"},{"$f":"IF($E33=\"\",\"\",VLOOKUP($E33,'piros lány elo'!$A$7:$O$22,3))","v":0},null,{"$f":"IF($E33=\"\",\"\",VLOOKUP($E33,'piros lány elo'!$A$7:$O$22,4))","v":"Szombathely"},null,"2/0"]
[null,null,null,null,null,null,null,null,null,null,"Umpire","a",{"$f":"UPPER(IF(OR(L34=\"a\",L34=\"as\"),K32,IF(OR(L34=\"b\",L34=\"bs\"),K36,)))","v":"PARAGVARI"}]
[15,{"$f":"IF($E35=\"\",\"\",VLOOKUP($E35,'piros lány elo'!$A$7:$O$22,14))","v":""},{"$f":"IF($E35=\"\",\"\",VLOOKUP($E35,'piros lány elo'!$A$7:$O$22,15))","v":""},{"$f":"IF($E35=\"\",\"\",VLOOKUP($E35,'piros lány elo'!$A$7:$O$22,5))","v":""},null,"x",{"$f":"IF($E35=\"\",\"\",VLOOKUP($E35,'piros lány elo'!$A$7:$O$22,3))","v":""},null,{"$f":"IF($E35=\"\",\"\",VLOOKUP($E35,'piros lány elo'!$A$7:$O$22,4))","v":""},null,null,null,"2/0"]
[null,null,null,null,null,null,null,null,"Umpire","bs",{"$f":"UPPER(IF(OR(J36=\"a\",J36=\"as\"),F35,IF(OR(J36=\"b\",J36=\"bs\"),F37,)))","v":"BOGLÁRI ÁLTALÁNOS ISKOLA ÉS ALAPFOKÚ MŰVÉSZETI ISKOLA"}]
[16,{"$f":"IF($E37=\"\",\"\",VLOOKUP($E37,'piros lány elo'!$A$7:$O$22,14))","v":0},{"$f":"IF($E37=\"\",\"\",VLOOKUP($E37,'piros lány elo'!$A$7:$O$22,15))","v":0},{"$f":"IF($E37=\"\",\"\",VLOOKUP($E37,'piros lány elo'!$A$7:$O$22,5))","v":0},2,{"$f":"UPPER(IF($E37=\"\",\"\",VLOOKUP($E37,'piros lány elo'!$A$7:$O$22,2)))","v":"BOGLÁRI ÁLTALÁNOS ISKOLA ÉS ALAPFOKÚ MŰVÉSZETI ISKOLA"},{"$f":"IF($E37=\"\",\"\",VLOOKUP($E37,'piros lány elo'!$A$7:$O$22,3))","v":0},null,{"$f":"IF($E37=\"\",\"\",VLOOKUP($E37,'piros lány elo'!$A$7:$O$22,4))","v":"Balatonboglár"}]
[]
[]
[]
[]
[]
[]
[]
[]
[]
[]
[]
["Rangsor",null,null,null,"#","Kiemeltek",null,null,null,"#","Szerencés Vesztes",null,"Helyettesíti",null,"Sorsolás időpontja"]
["Dátuma",null,null,null,1,{"$f":"IF(E50>$R$57,,UPPER(VLOOKUP(E50,'piros lány elo'!$A$7:$Q$134,2)))","v":"BENCÉS APÁTSÁG ILLYÉS GYULA ÁLT ÉS ALAPFOKÚ MŰVÉSZETI ISKOLÁJA"},null,null,null,"1",null,null,null,null,"Utolsó elfogadott játékos"]
["Utolsó DA",null,null,null,2,{"$f":"IF(E51>$R$57,,UPPER(VLOOKUP(E51,'piros lány elo'!$A$7:$Q$134,2)))","v":"BOGLÁRI ÁLTALÁNOS ISKOLA ÉS ALAPFOKÚ MŰVÉSZETI ISKOLA"},null,null,null,"2"]
[null,null,null,null,3,{"$f":"IF(E52>$R$57,,UPPER(VLOOKUP(E52,'piros lány elo'!$A$7:$Q$134,2)))","v":"DIÓSGYŐRI NAGY LAJOS KIRÁLY ÁLTALÁNOS ISKOLA A"},null,null,null,"3","3 hely Diósgy. Nagy L.-Pollack  0/2",null,null,null,"Sorsoló játékosok"]
[null,null,null,null,4,{"$f":"IF(E53>$R$57,,UPPER(VLOOKUP(E53,'piros lány elo'!$A$7:$Q$134,2)))","v":""},null,null,null,"4"]
[null,null,null,null,null,null,null,null,null,"5"]
[null,null,null,null,null,null,null,null,null,"6",null,null,null,null,"Versenybíró aláírása"]
[null,null,null,null,null,null,null,null,null,"7"]
[null,null,null,null,null,null,null,null,null,"8",null,null,null,null,{"$f":"R4","v":"Rákóczi Andrea"},null,null,{"$f":"MIN(4,'piros lány elo'!Q5)","v":4}]

{"sheet":"narancs lány elo","index":5,"n_rows":156,"n_cols":17,"rows_kept":156,"cut":false,"hidden":false,"merged":[]}
[{"$f":"Altalanos!$A$6","v":"Diákolimpia Orsz. Döntő"},null,null,null,"Egyéni főtábla"]
[null,"Versenyszám:",{"$f":"Altalanos!$D$8","v":"Nrancs lány"},null,"ELŐKÉSZÍTŐ LISTA"]
["NE TÖRÖLD KI EZT AZ OLDALT!     ",null,null,null,null,null,null,null,null,null,null,null,null,"Versenybíró aláírása"]
["Dátum",null,"Város","Kategória",null,null,null,"Versenybíró"]
[{"$f":"Altalanos!$A$10","v":"2018.05.28-31."},null,{"$f":"Altalanos!$C$10","v":"Balatonboglár"},{"$f":"Altalanos!$D$10","v":"  "},null,null,null,{"$f":"Altalanos!$E$10","v":"Rákóczi Andrea"}]
["Sor","Családi név","Keresztnév","Egyesület","Kódszám","Nevezett Igen","Aláírás","Nevezési rangsor",null,"NatSort\nif not \nSeed","NatSort","Seed Sort","AccBasic","Elfogadási státusz","Sorsolási rangsor","AccSort","Kiemelés"]
[1,"Gothard Jenő Általános Iskola",null,"Szombathely"]
[2,"Kodály Zoltán Ének-zenei Ált. Isk.",null,"Győri"]
[3,"Pécsi Bártfa Utcai Általános Iskola",null,"Pécs"]
[4,"Siófoki Széchenyi István Általános Iskola",null,"Siófok"]
[5,"II.Rákóczi Ferenc Ált Isk.és Gimnázium",null,"Szentendre"]
[6]
[7]
[8]
[9]
[10]
[11]
[12]
[13]
[14]
[15]
[16]
[17]
[18]
[19]
[20]
[21]
[22]
[23]
[24]
[25]
[26]
[27]
[28]
[29]
[30]
[31]
[32]
[33]
[34,null,null,null,null,null,null,null,null,{"$f":"IF(AND(Q40=\"\",#REF!>0,#REF!<5),K40,)","v":{"$error":"#REF!"}},{"$f":"IF(D40=\"\",\"ZZZ9\",IF(AND(#REF!>0,#REF!<5),D40&#REF!,D40&\"9\"))","v":"ZZZ9"},{"$f":"IF(Q40=\"\",999,Q40)","v":999},{"$f":"IF(P40=999,999,1)","v":999},null,null,{"$f":"IF(N40=\"DA\",1,IF(N40=\"WC\",2,IF(N40=\"SE\",3,IF(N40=\"Q\",4,IF(N40=\"LL\",5,999)))))","v":999}]
[35,null,null,null,null,null,null,null,null,{"$f":"IF(AND(Q41=\"\",#REF!>0,#REF!<5),K41,)","v":{"$error":"#REF!"}},{"$f":"IF(D41=\"\",\"ZZZ9\",IF(AND(#REF!>0,#REF!<5),D41&#REF!,D41&\"9\"))","v":"ZZZ9"},999,999,null,null,999]
[36,null,null,null,null,null,null,null,null,{"$f":"IF(AND(Q42=\"\",#REF!>0,#REF!<5),K42,)","v":{"$error":"#REF!"}},{"$f":"IF(D42=\"\",\"ZZZ9\",IF(AND(#REF!>0,#REF!<5),D42&#REF!,D42&\"9\"))","v":"ZZZ9"},999,999,null,null,999]
[37,null,null,null,null,null,null,null,null,{"$f":"IF(AND(Q43=\"\",#REF!>0,#REF!<5),K43,)","v":{"$error":"#REF!"}},{"$f":"IF(D43=\"\",\"ZZZ9\",IF(AND(#REF!>0,#REF!<5),D43&#REF!,D43&\"9\"))","v":"ZZZ9"},999,999,null,null,999]
[38,null,null,null,null,null,null,null,null,{"$f":"IF(AND(Q44=\"\",#REF!>0,#REF!<5),K44,)","v":{"$error":"#REF!"}},{"$f":"IF(D44=\"\",\"ZZZ9\",IF(AND(#REF!>0,#REF!<5),D44&#REF!,D44&\"9\"))","v":"ZZZ9"},999,999,null,null,999]
[39,null,null,null,null,null,null,null,null,{"$f":"IF(AND(Q45=\"\",#REF!>0,#REF!<5),K45,)","v":{"$error":"#REF!"}},{"$f":"IF(D45=\"\",\"ZZZ9\",IF(AND(#REF!>0,#REF!<5),D45&#REF!,D45&\"9\"))","v":"ZZZ9"},999,999,null,null,999]
[40,null,null,null,null,null,null,null,null,{"$f":"IF(AND(Q46=\"\",#REF!>0,#REF!<5),K46,)","v":{"$error":"#REF!"}},{"$f":"IF(D46=\"\",\"ZZZ9\",IF(AND(#REF!>0,#REF!<5),D46&#REF!,D46&\"9\"))","v":"ZZZ9"},999,999,null,null,999]
[41,null,null,null,null,null,null,null,null,{"$f":"IF(AND(Q47=\"\",#REF!>0,#REF!<5),K47,)","v":{"$error":"#REF!"}},{"$f":"IF(D47=\"\",\"ZZZ9\",IF(AND(#REF!>0,#REF!<5),D47&#REF!,D47&\"9\"))","v":"ZZZ9"},999,999,null,null,999]
[42,null,null,null,null,null,null,null,null,{"$f":"IF(AND(Q48=\"\",#REF!>0,#REF!<5),K48,)","v":{"$error":"#REF!"}},{"$f":"IF(D48=\"\",\"ZZZ9\",IF(AND(#REF!>0,#REF!<5),D48&#REF!,D48&\"9\"))","v":"ZZZ9"},999,999,null,null,999]
[43,null,null,null,null,null,null,null,null,{"$f":"IF(AND(Q49=\"\",#REF!>0,#REF!<5),K49,)","v":{"$error":"#REF!"}},{"$f":"IF(D49=\"\",\"ZZZ9\",IF(AND(#REF!>0,#REF!<5),D49&#REF!,D49&\"9\"))","v":"ZZZ9"},999,999,null,null,999]
[44,null,null,null,null,null,null,null,null,{"$f":"IF(AND(Q50=\"\",#REF!>0,#REF!<5),K50,)","v":{"$error":"#REF!"}},{"$f":"IF(D50=\"\",\"ZZZ9\",IF(AND(#REF!>0,#REF!<5),D50&#REF!,D50&\"9\"))","v":"ZZZ9"},999,999,null,null,999]
[45,null,null,null,null,null,null,null,null,{"$f":"IF(AND(Q51=\"\",#REF!>0,#REF!<5),K51,)","v":{"$error":"#REF!"}},{"$f":"IF(D51=\"\",\"ZZZ9\",IF(AND(#REF!>0,#REF!<5),D51&#REF!,D51&\"9\"))","v":"ZZZ9"},999,999,null,null,999]
[46,null,null,null,null,null,null,null,null,{"$f":"IF(AND(Q52=\"\",#REF!>0,#REF!<5),K52,)","v":{"$error":"#REF!"}},{"$f":"IF(D52=\"\",\"ZZZ9\",IF(AND(#REF!>0,#REF!<5),D52&#REF!,D52&\"9\"))","v":"ZZZ9"},999,999,null,null,999]
[47,null,null,null,null,null,null,null,null,{"$f":"IF(AND(Q53=\"\",#REF!>0,#REF!<5),K53,)","v":{"$error":"#REF!"}},{"$f":"IF(D53=\"\",\"ZZZ9\",IF(AND(#REF!>0,#REF!<5),D53&#REF!,D53&\"9\"))","v":"ZZZ9"},999,999,null,null,999]
[48,null,null,null,null,null,null,null,null,{"$f":"IF(AND(Q54=\"\",#REF!>0,#REF!<5),K54,)","v":{"$error":"#REF!"}},{"$f":"IF(D54=\"\",\"ZZZ9\",IF(AND(#REF!>0,#REF!<5),D54&#REF!,D54&\"9\"))","v":"ZZZ9"},999,999,null,null,999]
[49,null,null,null,null,null,null,null,null,{"$f":"IF(AND(Q55=\"\",#REF!>0,#REF!<5),K55,)","v":{"$error":"#REF!"}},{"$f":"IF(D55=\"\",\"ZZZ9\",IF(AND(#REF!>0,#REF!<5),D55&#REF!,D55&\"9\"))","v":"ZZZ9"},999,999,null,null,999]
[50,null,null,null,null,null,null,null,null,{"$f":"IF(AND(Q56=\"\",#REF!>0,#REF!<5),K56,)","v":{"$error":"#REF!"}},{"$f":"IF(D56=\"\",\"ZZZ9\",IF(AND(#REF!>0,#REF!<5),D56&#REF!,D56&\"9\"))","v":"ZZZ9"},999,999,null,null,999]
[51,null,null,null,null,null,null,null,null,{"$f":"IF(AND(Q57=\"\",#REF!>0,#REF!<5),K57,)","v":{"$error":"#REF!"}},{"$f":"IF(D57=\"\",\"ZZZ9\",IF(AND(#REF!>0,#REF!<5),D57&#REF!,D57&\"9\"))","v":"ZZZ9"},999,999,null,null,999]
[52,null,null,null,null,null,null,null,null,{"$f":"IF(AND(Q58=\"\",#REF!>0,#REF!<5),K58,)","v":{"$error":"#REF!"}},{"$f":"IF(D58=\"\",\"ZZZ9\",IF(AND(#REF!>0,#REF!<5),D58&#REF!,D58&\"9\"))","v":"ZZZ9"},999,999,null,null,999]
[53,null,null,null,null,null,null,null,null,{"$f":"IF(AND(Q59=\"\",#REF!>0,#REF!<5),K59,)","v":{"$error":"#REF!"}},{"$f":"IF(D59=\"\",\"ZZZ9\",IF(AND(#REF!>0,#REF!<5),D59&#REF!,D59&\"9\"))","v":"ZZZ9"},999,999,null,null,999]
[54,null,null,null,null,null,null,null,null,{"$f":"IF(AND(Q60=\"\",#REF!>0,#REF!<5),K60,)","v":{"$error":"#REF!"}},{"$f":"IF(D60=\"\",\"ZZZ9\",IF(AND(#REF!>0,#REF!<5),D60&#REF!,D60&\"9\"))","v":"ZZZ9"},999,999,null,null,999]
[55,null,null,null,null,null,null,null,null,{"$f":"IF(AND(Q61=\"\",#REF!>0,#REF!<5),K61,)","v":{"$error":"#REF!"}},{"$f":"IF(D61=\"\",\"ZZZ9\",IF(AND(#REF!>0,#REF!<5),D61&#REF!,D61&\"9\"))","v":"ZZZ9"},999,999,null,null,999]
[56,null,null,null,null,null,null,null,null,{"$f":"IF(AND(Q62=\"\",#REF!>0,#REF!<5),K62,)","v":{"$error":"#REF!"}},{"$f":"IF(D62=\"\",\"ZZZ9\",IF(AND(#REF!>0,#REF!<5),D62&#REF!,D62&\"9\"))","v":"ZZZ9"},999,999,null,null,999]
[57,null,null,null,null,null,null,null,null,{"$f":"IF(AND(Q63=\"\",#REF!>0,#REF!<5),K63,)","v":{"$error":"#REF!"}},{"$f":"IF(D63=\"\",\"ZZZ9\",IF(AND(#REF!>0,#REF!<5),D63&#REF!,D63&\"9\"))","v":"ZZZ9"},999,999,null,null,999]
[58,null,null,null,null,null,null,null,null,{"$f":"IF(AND(Q64=\"\",#REF!>0,#REF!<5),K64,)","v":{"$error":"#REF!"}},{"$f":"IF(D64=\"\",\"ZZZ9\",IF(AND(#REF!>0,#REF!<5),D64&#REF!,D64&\"9\"))","v":"ZZZ9"},999,999,null,null,999]
[59,null,null,null,null,null,null,null,null,{"$f":"IF(AND(Q65=\"\",#REF!>0,#REF!<5),K65,)","v":{"$error":"#REF!"}},{"$f":"IF(D65=\"\",\"ZZZ9\",IF(AND(#REF!>0,#REF!<5),D65&#REF!,D65&\"9\"))","v":"ZZZ9"},999,999,null,null,999]
[60,null,null,null,null,null,null,null,null,{"$f":"IF(AND(Q66=\"\",#REF!>0,#REF!<5),K66,)","v":{"$error":"#REF!"}},{"$f":"IF(D66=\"\",\"ZZZ9\",IF(AND(#REF!>0,#REF!<5),D66&#REF!,D66&\"9\"))","v":"ZZZ9"},999,999,null,null,999]
[61,null,null,null,null,null,null,null,null,{"$f":"IF(AND(Q67=\"\",#REF!>0,#REF!<5),K67,)","v":{"$error":"#REF!"}},{"$f":"IF(D67=\"\",\"ZZZ9\",IF(AND(#REF!>0,#REF!<5),D67&#REF!,D67&\"9\"))","v":"ZZZ9"},999,999,null,null,999]
[62,null,null,null,null,null,null,null,null,{"$f":"IF(AND(Q68=\"\",#REF!>0,#REF!<5),K68,)","v":{"$error":"#REF!"}},{"$f":"IF(D68=\"\",\"ZZZ9\",IF(AND(#REF!>0,#REF!<5),D68&#REF!,D68&\"9\"))","v":"ZZZ9"},999,999,null,null,999]
[63,null,null,null,null,null,null,null,null,{"$f":"IF(AND(Q69=\"\",#REF!>0,#REF!<5),K69,)","v":{"$error":"#REF!"}},{"$f":"IF(D69=\"\",\"ZZZ9\",IF(AND(#REF!>0,#REF!<5),D69&#REF!,D69&\"9\"))","v":"ZZZ9"},999,999,null,null,999]
[64,null,null,null,null,null,null,null,null,{"$f":"IF(AND(Q70=\"\",#REF!>0,#REF!<5),K70,)","v":{"$error":"#REF!"}},{"$f":"IF(D70=\"\",\"ZZZ9\",IF(AND(#REF!>0,#REF!<5),D70&#REF!,D70&\"9\"))","v":"ZZZ9"},999,999,null,null,999]
[65,null,null,null,null,null,null,null,null,{"$f":"IF(AND(Q71=\"\",#REF!>0,#REF!<5),K71,)","v":{"$error":"#REF!"}},{"$f":"IF(D71=\"\",\"ZZZ9\",IF(AND(#REF!>0,#REF!<5),D71&#REF!,D71&\"9\"))","v":"ZZZ9"},999,999,null,null,999]
[66,null,null,null,null,null,null,null,null,{"$f":"IF(AND(Q72=\"\",#REF!>0,#REF!<5),K72,)","v":{"$error":"#REF!"}},{"$f":"IF(D72=\"\",\"ZZZ9\",IF(AND(#REF!>0,#REF!<5),D72&#REF!,D72&\"9\"))","v":"ZZZ9"},999,999,null,null,999]
[67,null,null,null,null,null,null,null,null,{"$f":"IF(AND(Q73=\"\",#REF!>0,#REF!<5),K73,)","v":{"$error":"#REF!"}},{"$f":"IF(D73=\"\",\"ZZZ9\",IF(AND(#REF!>0,#REF!<5),D73&#REF!,D73&\"9\"))","v":"ZZZ9"},999,999,null,null,999]
[68,null,null,null,null,null,null,null,null,{"$f":"IF(AND(Q74=\"\",#REF!>0,#REF!<5),K74,)","v":{"$error":"#REF!"}},{"$f":"IF(D74=\"\",\"ZZZ9\",IF(AND(#REF!>0,#REF!<5),D74&#REF!,D74&\"9\"))","v":"ZZZ9"},999,999,null,null,999]
[69,null,null,null,null,null,null,null,null,{"$f":"IF(AND(Q75=\"\",#REF!>0,#REF!<5),K75,)","v":{"$error":"#REF!"}},{"$f":"IF(D75=\"\",\"ZZZ9\",IF(AND(#REF!>0,#REF!<5),D75&#REF!,D75&\"9\"))","v":"ZZZ9"},999,999,null,null,999]
[70,null,null,null,null,null,null,null,null,{"$f":"IF(AND(Q76=\"\",#REF!>0,#REF!<5),K76,)","v":{"$error":"#REF!"}},{"$f":"IF(D76=\"\",\"ZZZ9\",IF(AND(#REF!>0,#REF!<5),D76&#REF!,D76&\"9\"))","v":"ZZZ9"},999,999,null,null,999]
[71,null,null,null,null,null,null,null,null,{"$f":"IF(AND(Q77=\"\",#REF!>0,#REF!<5),K77,)","v":{"$error":"#REF!"}},{"$f":"IF(D77=\"\",\"ZZZ9\",IF(AND(#REF!>0,#REF!<5),D77&#REF!,D77&\"9\"))","v":"ZZZ9"},999,999,null,null,999]
[72,null,null,null,null,null,null,null,null,{"$f":"IF(AND(Q78=\"\",#REF!>0,#REF!<5),K78,)","v":{"$error":"#REF!"}},{"$f":"IF(D78=\"\",\"ZZZ9\",IF(AND(#REF!>0,#REF!<5),D78&#REF!,D78&\"9\"))","v":"ZZZ9"},999,999,null,null,999]
[73,null,null,null,null,null,null,null,null,{"$f":"IF(AND(Q79=\"\",#REF!>0,#REF!<5),K79,)","v":{"$error":"#REF!"}},{"$f":"IF(D79=\"\",\"ZZZ9\",IF(AND(#REF!>0,#REF!<5),D79&#REF!,D79&\"9\"))","v":"ZZZ9"},999,999,null,null,999]
[74,null,null,null,null,null,null,null,null,{"$f":"IF(AND(Q80=\"\",#REF!>0,#REF!<5),K80,)","v":{"$error":"#REF!"}},{"$f":"IF(D80=\"\",\"ZZZ9\",IF(AND(#REF!>0,#REF!<5),D80&#REF!,D80&\"9\"))","v":"ZZZ9"},999,999,null,null,999]
[75,null,null,null,null,null,null,null,null,{"$f":"IF(AND(Q81=\"\",#REF!>0,#REF!<5),K81,)","v":{"$error":"#REF!"}},{"$f":"IF(D81=\"\",\"ZZZ9\",IF(AND(#REF!>0,#REF!<5),D81&#REF!,D81&\"9\"))","v":"ZZZ9"},999,999,null,null,999]
[76,null,null,null,null,null,null,null,null,{"$f":"IF(AND(Q82=\"\",#REF!>0,#REF!<5),K82,)","v":{"$error":"#REF!"}},{"$f":"IF(D82=\"\",\"ZZZ9\",IF(AND(#REF!>0,#REF!<5),D82&#REF!,D82&\"9\"))","v":"ZZZ9"},999,999,null,null,999]
[77,null,null,null,null,null,null,null,null,{"$f":"IF(AND(Q83=\"\",#REF!>0,#REF!<5),K83,)","v":{"$error":"#REF!"}},{"$f":"IF(D83=\"\",\"ZZZ9\",IF(AND(#REF!>0,#REF!<5),D83&#REF!,D83&\"9\"))","v":"ZZZ9"},999,999,null,null,999]
[78,null,null,null,null,null,null,null,null,{"$f":"IF(AND(Q84=\"\",#REF!>0,#REF!<5),K84,)","v":{"$error":"#REF!"}},{"$f":"IF(D84=\"\",\"ZZZ9\",IF(AND(#REF!>0,#REF!<5),D84&#REF!,D84&\"9\"))","v":"ZZZ9"},999,999,null,null,999]
[79,null,null,null,null,null,null,null,null,{"$f":"IF(AND(Q85=\"\",#REF!>0,#REF!<5),K85,)","v":{"$error":"#REF!"}},{"$f":"IF(D85=\"\",\"ZZZ9\",IF(AND(#REF!>0,#REF!<5),D85&#REF!,D85&\"9\"))","v":"ZZZ9"},999,999,null,null,999]
[80,null,null,null,null,null,null,null,null,{"$f":"IF(AND(Q86=\"\",#REF!>0,#REF!<5),K86,)","v":{"$error":"#REF!"}},{"$f":"IF(D86=\"\",\"ZZZ9\",IF(AND(#REF!>0,#REF!<5),D86&#REF!,D86&\"9\"))","v":"ZZZ9"},999,999,null,null,999]
[81,null,null,null,null,null,null,null,null,{"$f":"IF(AND(Q87=\"\",#REF!>0,#REF!<5),K87,)","v":{"$error":"#REF!"}},{"$f":"IF(D87=\"\",\"ZZZ9\",IF(AND(#REF!>0,#REF!<5),D87&#REF!,D87&\"9\"))","v":"ZZZ9"},999,999,null,null,999]
[82,null,null,null,null,null,null,null,null,{"$f":"IF(AND(Q88=\"\",#REF!>0,#REF!<5),K88,)","v":{"$error":"#REF!"}},{"$f":"IF(D88=\"\",\"ZZZ9\",IF(AND(#REF!>0,#REF!<5),D88&#REF!,D88&\"9\"))","v":"ZZZ9"},999,999,null,null,999]
[83,null,null,null,null,null,null,null,null,{"$f":"IF(AND(Q89=\"\",#REF!>0,#REF!<5),K89,)","v":{"$error":"#REF!"}},{"$f":"IF(D89=\"\",\"ZZZ9\",IF(AND(#REF!>0,#REF!<5),D89&#REF!,D89&\"9\"))","v":"ZZZ9"},999,999,null,null,999]
[84,null,null,null,null,null,null,null,null,{"$f":"IF(AND(Q90=\"\",#REF!>0,#REF!<5),K90,)","v":{"$error":"#REF!"}},{"$f":"IF(D90=\"\",\"ZZZ9\",IF(AND(#REF!>0,#REF!<5),D90&#REF!,D90&\"9\"))","v":"ZZZ9"},999,999,null,null,999]
[85,null,null,null,null,null,null,null,null,{"$f":"IF(AND(Q91=\"\",#REF!>0,#REF!<5),K91,)","v":{"$error":"#REF!"}},{"$f":"IF(D91=\"\",\"ZZZ9\",IF(AND(#REF!>0,#REF!<5),D91&#REF!,D91&\"9\"))","v":"ZZZ9"},999,999,null,null,999]
[86,null,null,null,null,null,null,null,null,{"$f":"IF(AND(Q92=\"\",#REF!>0,#REF!<5),K92,)","v":{"$error":"#REF!"}},{"$f":"IF(D92=\"\",\"ZZZ9\",IF(AND(#REF!>0,#REF!<5),D92&#REF!,D92&\"9\"))","v":"ZZZ9"},999,999,null,null,999]
[87,null,null,null,null,null,null,null,null,{"$f":"IF(AND(Q93=\"\",#REF!>0,#REF!<5),K93,)","v":{"$error":"#REF!"}},{"$f":"IF(D93=\"\",\"ZZZ9\",IF(AND(#REF!>0,#REF!<5),D93&#REF!,D93&\"9\"))","v":"ZZZ9"},999,999,null,null,999]
[88,null,null,null,null,null,null,null,null,{"$f":"IF(AND(Q94=\"\",#REF!>0,#REF!<5),K94,)","v":{"$error":"#REF!"}},{"$f":"IF(D94=\"\",\"ZZZ9\",IF(AND(#REF!>0,#REF!<5),D94&#REF!,D94&\"9\"))","v":"ZZZ9"},999,999,null,null,999]
[89,null,null,null,null,null,null,null,null,{"$f":"IF(AND(Q95=\"\",#REF!>0,#REF!<5),K95,)","v":{"$error":"#REF!"}},{"$f":"IF(D95=\"\",\"ZZZ9\",IF(AND(#REF!>0,#REF!<5),D95&#REF!,D95&\"9\"))","v":"ZZZ9"},999,999,null,null,999]
[90,null,null,null,null,null,null,null,null,{"$f":"IF(AND(Q96=\"\",#REF!>0,#REF!<5),K96,)","v":{"$error":"#REF!"}},{"$f":"IF(D96=\"\",\"ZZZ9\",IF(AND(#REF!>0,#REF!<5),D96&#REF!,D96&\"9\"))","v":"ZZZ9"},999,999,null,null,999]
[91,null,null,null,null,null,null,null,null,{"$f":"IF(AND(Q97=\"\",#REF!>0,#REF!<5),K97,)","v":{"$error":"#REF!"}},{"$f":"IF(D97=\"\",\"ZZZ9\",IF(AND(#REF!>0,#REF!<5),D97&#REF!,D97&\"9\"))","v":"ZZZ9"},999,999,null,null,999]
[92,null,null,null,null,null,null,null,null,{"$f":"IF(AND(Q98=\"\",#REF!>0,#REF!<5),K98,)","v":{"$error":"#REF!"}},{"$f":"IF(D98=\"\",\"ZZZ9\",IF(AND(#REF!>0,#REF!<5),D98&#REF!,D98&\"9\"))","v":"ZZZ9"},999,999,null,null,999]
[93,null,null,null,null,null,null,null,null,{"$f":"IF(AND(Q99=\"\",#REF!>0,#REF!<5),K99,)","v":{"$error":"#REF!"}},{"$f":"IF(D99=\"\",\"ZZZ9\",IF(AND(#REF!>0,#REF!<5),D99&#REF!,D99&\"9\"))","v":"ZZZ9"},999,999,null,null,999]
[94,null,null,null,null,null,null,null,null,{"$f":"IF(AND(Q100=\"\",#REF!>0,#REF!<5),K100,)","v":{"$error":"#REF!"}},{"$f":"IF(D100=\"\",\"ZZZ9\",IF(AND(#REF!>0,#REF!<5),D100&#REF!,D100&\"9\"))","v":"ZZZ9"},999,999,null,null,999]
[95,null,null,null,null,null,null,null,null,{"$f":"IF(AND(Q101=\"\",#REF!>0,#REF!<5),K101,)","v":{"$error":"#REF!"}},{"$f":"IF(D101=\"\",\"ZZZ9\",IF(AND(#REF!>0,#REF!<5),D101&#REF!,D101&\"9\"))","v":"ZZZ9"},999,999,null,null,999]
[96,null,null,null,null,null,null,null,null,{"$f":"IF(AND(Q102=\"\",#REF!>0,#REF!<5),K102,)","v":{"$error":"#REF!"}},{"$f":"IF(D102=\"\",\"ZZZ9\",IF(AND(#REF!>0,#REF!<5),D102&#REF!,D102&\"9\"))","v":"ZZZ9"},999,999,null,null,999]
[97,null,null,null,null,null,null,null,null,{"$f":"IF(AND(Q103=\"\",#REF!>0,#REF!<5),K103,)","v":{"$error":"#REF!"}},{"$f":"IF(D103=\"\",\"ZZZ9\",IF(AND(#REF!>0,#REF!<5),D103&#REF!,D103&\"9\"))","v":"ZZZ9"},999,999,null,null,999]
[98,null,null,null,null,null,null,null,null,{"$f":"IF(AND(Q104=\"\",#REF!>0,#REF!<5),K104,)","v":{"$error":"#REF!"}},{"$f":"IF(D104=\"\",\"ZZZ9\",IF(AND(#REF!>0,#REF!<5),D104&#REF!,D104&\"9\"))","v":"ZZZ9"},{"$f":"IF(Q104=\"\",999,Q104)","v":999},{"$f":"IF(P104=999,999,1)","v":999},null,null,{"$f":"IF(N104=\"DA\",1,IF(N104=\"WC\",2,IF(N104=\"SE\",3,IF(N104=\"Q\",4,IF(N104=\"LL\",5,999)))))","v":999}]
[99,null,null,null,null,null,null,null,null,{"$f":"IF(AND(Q105=\"\",#REF!>0,#REF!<5),K105,)","v":{"$error":"#REF!"}},{"$f":"IF(D105=\"\",\"ZZZ9\",IF(AND(#REF!>0,#REF!<5),D105&#REF!,D105&\"9\"))","v":"ZZZ9"},999,999,null,null,999]
[100,null,null,null,null,null,null,null,null,{"$f":"IF(AND(Q106=\"\",#REF!>0,#REF!<5),K106,)","v":{"$error":"#REF!"}},{"$f":"IF(D106=\"\",\"ZZZ9\",IF(AND(#REF!>0,#REF!<5),D106&#REF!,D106&\"9\"))","v":"ZZZ9"},999,999,null,null,999]
[101,null,null,null,null,null,null,null,null,{"$f":"IF(AND(Q107=\"\",#REF!>0,#REF!<5),K107,)","v":{"$error":"#REF!"}},{"$f":"IF(D107=\"\",\"ZZZ9\",IF(AND(#REF!>0,#REF!<5),D107&#REF!,D107&\"9\"))","v":"ZZZ9"},999,999,null,null,999]
[102,null,null,null,null,null,null,null,null,{"$f":"IF(AND(Q108=\"\",#REF!>0,#REF!<5),K108,)","v":{"$error":"#REF!"}},{"$f":"IF(D108=\"\",\"ZZZ9\",IF(AND(#REF!>0,#REF!<5),D108&#REF!,D108&\"9\"))","v":"ZZZ9"},999,999,null,null,999]
[103,null,null,null,null,null,null,null,null,{"$f":"IF(AND(Q109=\"\",#REF!>0,#REF!<5),K109,)","v":{"$error":"#REF!"}},{"$f":"IF(D109=\"\",\"ZZZ9\",IF(AND(#REF!>0,#REF!<5),D109&#REF!,D109&\"9\"))","v":"ZZZ9"},999,999,null,null,999]
[104,null,null,null,null,null,null,null,null,{"$f":"IF(AND(Q110=\"\",#REF!>0,#REF!<5),K110,)","v":{"$error":"#REF!"}},{"$f":"IF(D110=\"\",\"ZZZ9\",IF(AND(#REF!>0,#REF!<5),D110&#REF!,D110&\"9\"))","v":"ZZZ9"},999,999,null,null,999]
[105,null,null,null,null,null,null,null,null,{"$f":"IF(AND(Q111=\"\",#REF!>0,#REF!<5),K111,)","v":{"$error":"#REF!"}},{"$f":"IF(D111=\"\",\"ZZZ9\",IF(AND(#REF!>0,#REF!<5),D111&#REF!,D111&\"9\"))","v":"ZZZ9"},999,999,null,null,999]
[106,null,null,null,null,null,null,null,null,{"$f":"IF(AND(Q112=\"\",#REF!>0,#REF!<5),K112,)","v":{"$error":"#REF!"}},{"$f":"IF(D112=\"\",\"ZZZ9\",IF(AND(#REF!>0,#REF!<5),D112&#REF!,D112&\"9\"))","v":"ZZZ9"},999,999,null,null,999]
[107,null,null,null,null,null,null,null,null,{"$f":"IF(AND(Q113=\"\",#REF!>0,#REF!<5),K113,)","v":{"$error":"#REF!"}},{"$f":"IF(D113=\"\",\"ZZZ9\",IF(AND(#REF!>0,#REF!<5),D113&#REF!,D113&\"9\"))","v":"ZZZ9"},999,999,null,null,999]
[108,null,null,null,null,null,null,null,null,{"$f":"IF(AND(Q114=\"\",#REF!>0,#REF!<5),K114,)","v":{"$error":"#REF!"}},{"$f":"IF(D114=\"\",\"ZZZ9\",IF(AND(#REF!>0,#REF!<5),D114&#REF!,D114&\"9\"))","v":"ZZZ9"},999,999,null,null,999]
[109,null,null,null,null,null,null,null,null,{"$f":"IF(AND(Q115=\"\",#REF!>0,#REF!<5),K115,)","v":{"$error":"#REF!"}},{"$f":"IF(D115=\"\",\"ZZZ9\",IF(AND(#REF!>0,#REF!<5),D115&#REF!,D115&\"9\"))","v":"ZZZ9"},999,999,null,null,999]
[110,null,null,null,null,null,null,null,null,{"$f":"IF(AND(Q116=\"\",#REF!>0,#REF!<5),K116,)","v":{"$error":"#REF!"}},{"$f":"IF(D116=\"\",\"ZZZ9\",IF(AND(#REF!>0,#REF!<5),D116&#REF!,D116&\"9\"))","v":"ZZZ9"},999,999,null,null,999]
[111,null,null,null,null,null,null,null,null,{"$f":"IF(AND(Q117=\"\",#REF!>0,#REF!<5),K117,)","v":{"$error":"#REF!"}},{"$f":"IF(D117=\"\",\"ZZZ9\",IF(AND(#REF!>0,#REF!<5),D117&#REF!,D117&\"9\"))","v":"ZZZ9"},999,999,null,null,999]
[112,null,null,null,null,null,null,null,null,{"$f":"IF(AND(Q118=\"\",#REF!>0,#REF!<5),K118,)","v":{"$error":"#REF!"}},{"$f":"IF(D118=\"\",\"ZZZ9\",IF(AND(#REF!>0,#REF!<5),D118&#REF!,D118&\"9\"))","v":"ZZZ9"},999,999,null,null,999]
[113,null,null,null,null,null,null,null,null,{"$f":"IF(AND(Q119=\"\",#REF!>0,#REF!<5),K119,)","v":{"$error":"#REF!"}},{"$f":"IF(D119=\"\",\"ZZZ9\",IF(AND(#REF!>0,#REF!<5),D119&#REF!,D119&\"9\"))","v":"ZZZ9"},999,999,null,null,999]
[114,null,null,null,null,null,null,null,null,{"$f":"IF(AND(Q120=\"\",#REF!>0,#REF!<5),K120,)","v":{"$error":"#REF!"}},{"$f":"IF(D120=\"\",\"ZZZ9\",IF(AND(#REF!>0,#REF!<5),D120&#REF!,D120&\"9\"))","v":"ZZZ9"},999,999,null,null,999]
[115,null,null,null,null,null,null,null,null,{"$f":"IF(AND(Q121=\"\",#REF!>0,#REF!<5),K121,)","v":{"$error":"#REF!"}},{"$f":"IF(D121=\"\",\"ZZZ9\",IF(AND(#REF!>0,#REF!<5),D121&#REF!,D121&\"9\"))","v":"ZZZ9"},999,999,null,null,999]
[116,null,null,null,null,null,null,null,null,{"$f":"IF(AND(Q122=\"\",#REF!>0,#REF!<5),K122,)","v":{"$error":"#REF!"}},{"$f":"IF(D122=\"\",\"ZZZ9\",IF(AND(#REF!>0,#REF!<5),D122&#REF!,D122&\"9\"))","v":"ZZZ9"},999,999,null,null,999]
[117,null,null,null,null,null,null,null,null,{"$f":"IF(AND(Q123=\"\",#REF!>0,#REF!<5),K123,)","v":{"$error":"#REF!"}},{"$f":"IF(D123=\"\",\"ZZZ9\",IF(AND(#REF!>0,#REF!<5),D123&#REF!,D123&\"9\"))","v":"ZZZ9"},999,999,null,null,999]
[118,null,null,null,null,null,null,null,null,{"$f":"IF(AND(Q124=\"\",#REF!>0,#REF!<5),K124,)","v":{"$error":"#REF!"}},{"$f":"IF(D124=\"\",\"ZZZ9\",IF(AND(#REF!>0,#REF!<5),D124&#REF!,D124&\"9\"))","v":"ZZZ9"},999,999,null,null,999]
[119,null,null,null,null,null,null,null,null,{"$f":"IF(AND(Q125=\"\",#REF!>0,#REF!<5),K125,)","v":{"$error":"#REF!"}},{"$f":"IF(D125=\"\",\"ZZZ9\",IF(AND(#REF!>0,#REF!<5),D125&#REF!,D125&\"9\"))","v":"ZZZ9"},999,999,null,null,999]
[120,null,null,null,null,null,null,null,null,{"$f":"IF(AND(Q126=\"\",#REF!>0,#REF!<5),K126,)","v":{"$error":"#REF!"}},{"$f":"IF(D126=\"\",\"ZZZ9\",IF(AND(#REF!>0,#REF!<5),D126&#REF!,D126&\"9\"))","v":"ZZZ9"},999,999,null,null,999]
[121,null,null,null,null,null,null,null,null,{"$f":"IF(AND(Q127=\"\",#REF!>0,#REF!<5),K127,)","v":{"$error":"#REF!"}},{"$f":"IF(D127=\"\",\"ZZZ9\",IF(AND(#REF!>0,#REF!<5),D127&#REF!,D127&\"9\"))","v":"ZZZ9"},999,999,null,null,999]
[122,null,null,null,null,null,null,null,null,{"$f":"IF(AND(Q128=\"\",#REF!>0,#REF!<5),K128,)","v":{"$error":"#REF!"}},{"$f":"IF(D128=\"\",\"ZZZ9\",IF(AND(#REF!>0,#REF!<5),D128&#REF!,D128&\"9\"))","v":"ZZZ9"},999,999,null,null,999]
[123,null,null,null,null,null,null,null,null,{"$f":"IF(AND(Q129=\"\",#REF!>0,#REF!<5),K129,)","v":{"$error":"#REF!"}},{"$f":"IF(D129=\"\",\"ZZZ9\",IF(AND(#REF!>0,#REF!<5),D129&#REF!,D129&\"9\"))","v":"ZZZ9"},999,999,null,null,999]
[124,null,null,null,null,null,null,null,null,{"$f":"IF(AND(Q130=\"\",#REF!>0,#REF!<5),K130,)","v":{"$error":"#REF!"}},{"$f":"IF(D130=\"\",\"ZZZ9\",IF(AND(#REF!>0,#REF!<5),D130&#REF!,D130&\"9\"))","v":"ZZZ9"},999,999,null,null,999]
[125,null,null,null,null,null,null,null,null,{"$f":"IF(AND(Q131=\"\",#REF!>0,#REF!<5),K131,)","v":{"$error":"#REF!"}},{"$f":"IF(D131=\"\",\"ZZZ9\",IF(AND(#REF!>0,#REF!<5),D131&#REF!,D131&\"9\"))","v":"ZZZ9"},999,999,null,null,999]
[126,null,null,null,null,null,null,null,null,{"$f":"IF(AND(Q132=\"\",#REF!>0,#REF!<5),K132,)","v":{"$error":"#REF!"}},{"$f":"IF(D132=\"\",\"ZZZ9\",IF(AND(#REF!>0,#REF!<5),D132&#REF!,D132&\"9\"))","v":"ZZZ9"},999,999,null,null,999]
[127,null,null,null,null,null,null,null,null,{"$f":"IF(AND(Q133=\"\",#REF!>0,#REF!<5),K133,)","v":{"$error":"#REF!"}},{"$f":"IF(D133=\"\",\"ZZZ9\",IF(AND(#REF!>0,#REF!<5),D133&#REF!,D133&\"9\"))","v":"ZZZ9"},999,999,null,null,999]
[128,null,null,null,null,null,null,null,null,{"$f":"IF(AND(Q134=\"\",#REF!>0,#REF!<5),K134,)","v":{"$error":"#REF!"}},{"$f":"IF(D134=\"\",\"ZZZ9\",IF(AND(#REF!>0,#REF!<5),D134&#REF!,D134&\"9\"))","v":"ZZZ9"},999,999,null,null,999]
[129,null,null,null,null,null,null,null,null,{"$f":"IF(AND(Q135=\"\",#REF!>0,#REF!<5),K135,)","v":{"$error":"#REF!"}},{"$f":"IF(D135=\"\",\"ZZZ9\",IF(AND(#REF!>0,#REF!<5),D135&#REF!,D135&\"9\"))","v":"ZZZ9"},999,999,null,null,999]
[130,null,null,null,null,null,null,null,null,{"$f":"IF(AND(Q136=\"\",#REF!>0,#REF!<5),K136,)","v":{"$error":"#REF!"}},{"$f":"IF(D136=\"\",\"ZZZ9\",IF(AND(#REF!>0,#REF!<5),D136&#REF!,D136&\"9\"))","v":"ZZZ9"},999,999,null,null,999]
[131,null,null,null,null,null,null,null,null,{"$f":"IF(AND(Q137=\"\",#REF!>0,#REF!<5),K137,)","v":{"$error":"#REF!"}},{"$f":"IF(D137=\"\",\"ZZZ9\",IF(AND(#REF!>0,#REF!<5),D137&#REF!,D137&\"9\"))","v":"ZZZ9"},999,999,null,null,999]
[132,null,null,null,null,null,null,null,null,{"$f":"IF(AND(Q138=\"\",#REF!>0,#REF!<5),K138,)","v":{"$error":"#REF!"}},{"$f":"IF(D138=\"\",\"ZZZ9\",IF(AND(#REF!>0,#REF!<5),D138&#REF!,D138&\"9\"))","v":"ZZZ9"},999,999,null,null,999]
[133,null,null,null,null,null,null,null,null,{"$f":"IF(AND(Q139=\"\",#REF!>0,#REF!<5),K139,)","v":{"$error":"#REF!"}},{"$f":"IF(D139=\"\",\"ZZZ9\",IF(AND(#REF!>0,#REF!<5),D139&#REF!,D139&\"9\"))","v":"ZZZ9"},999,999,null,null,999]
[134,null,null,null,null,null,null,null,null,{"$f":"IF(AND(Q140=\"\",#REF!>0,#REF!<5),K140,)","v":{"$error":"#REF!"}},{"$f":"IF(D140=\"\",\"ZZZ9\",IF(AND(#REF!>0,#REF!<5),D140&#REF!,D140&\"9\"))","v":"ZZZ9"},999,999,null,null,999]
[135,null,null,null,null,null,null,null,null,{"$f":"IF(AND(Q141=\"\",#REF!>0,#REF!<5),K141,)","v":{"$error":"#REF!"}},{"$f":"IF(D141=\"\",\"ZZZ9\",IF(AND(#REF!>0,#REF!<5),D141&#REF!,D141&\"9\"))","v":"ZZZ9"},999,999,null,null,999]
[136,null,null,null,null,null,null,null,null,{"$f":"IF(AND(Q142=\"\",#REF!>0,#REF!<5),K142,)","v":{"$error":"#REF!"}},{"$f":"IF(D142=\"\",\"ZZZ9\",IF(AND(#REF!>0,#REF!<5),D142&#REF!,D142&\"9\"))","v":"ZZZ9"},999,999,null,null,999]
[137,null,null,null,null,null,null,null,null,{"$f":"IF(AND(Q143=\"\",#REF!>0,#REF!<5),K143,)","v":{"$error":"#REF!"}},{"$f":"IF(D143=\"\",\"ZZZ9\",IF(AND(#REF!>0,#REF!<5),D143&#REF!,D143&\"9\"))","v":"ZZZ9"},999,999,null,null,999]
[138,null,null,null,null,null,null,null,null,{"$f":"IF(AND(Q144=\"\",#REF!>0,#REF!<5),K144,)","v":{"$error":"#REF!"}},{"$f":"IF(D144=\"\",\"ZZZ9\",IF(AND(#REF!>0,#REF!<5),D144&#REF!,D144&\"9\"))","v":"ZZZ9"},999,999,null,null,999]
[139,null,null,null,null,null,null,null,null,{"$f":"IF(AND(Q145=\"\",#REF!>0,#REF!<5),K145,)","v":{"$error":"#REF!"}},{"$f":"IF(D145=\"\",\"ZZZ9\",IF(AND(#REF!>0,#REF!<5),D145&#REF!,D145&\"9\"))","v":"ZZZ9"},999,999,null,null,999]
[140,null,null,null,null,null,null,null,null,{"$f":"IF(AND(Q146=\"\",#REF!>0,#REF!<5),K146,)","v":{"$error":"#REF!"}},{"$f":"IF(D146=\"\",\"ZZZ9\",IF(AND(#REF!>0,#REF!<5),D146&#REF!,D146&\"9\"))","v":"ZZZ9"},999,999,null,null,999]
[141,null,null,null,null,null,null,null,null,{"$f":"IF(AND(Q147=\"\",#REF!>0,#REF!<5),K147,)","v":{"$error":"#REF!"}},{"$f":"IF(D147=\"\",\"ZZZ9\",IF(AND(#REF!>0,#REF!<5),D147&#REF!,D147&\"9\"))","v":"ZZZ9"},999,999,null,null,999]
[142,null,null,null,null,null,null,null,null,{"$f":"IF(AND(Q148=\"\",#REF!>0,#REF!<5),K148,)","v":{"$error":"#REF!"}},{"$f":"IF(D148=\"\",\"ZZZ9\",IF(AND(#REF!>0,#REF!<5),D148&#REF!,D148&\"9\"))","v":"ZZZ9"},999,999,null,null,999]
[143,null,null,null,null,null,null,null,null,{"$f":"IF(AND(Q149=\"\",#REF!>0,#REF!<5),K149,)","v":{"$error":"#REF!"}},{"$f":"IF(D149=\"\",\"ZZZ9\",IF(AND(#REF!>0,#REF!<5),D149&#REF!,D149&\"9\"))","v":"ZZZ9"},999,999,null,null,999]
[144,null,null,null,null,null,null,null,null,{"$f":"IF(AND(Q150=\"\",#REF!>0,#REF!<5),K150,)","v":{"$error":"#REF!"}},{"$f":"IF(D150=\"\",\"ZZZ9\",IF(AND(#REF!>0,#REF!<5),D150&#REF!,D150&\"9\"))","v":"ZZZ9"},999,999,null,null,999]
[145,null,null,null,null,null,null,null,null,{"$f":"IF(AND(Q151=\"\",#REF!>0,#REF!<5),K151,)","v":{"$error":"#REF!"}},{"$f":"IF(D151=\"\",\"ZZZ9\",IF(AND(#REF!>0,#REF!<5),D151&#REF!,D151&\"9\"))","v":"ZZZ9"},999,999,null,null,999]
[146,null,null,null,null,null,null,null,null,{"$f":"IF(AND(Q152=\"\",#REF!>0,#REF!<5),K152,)","v":{"$error":"#REF!"}},{"$f":"IF(D152=\"\",\"ZZZ9\",IF(AND(#REF!>0,#REF!<5),D152&#REF!,D152&\"9\"))","v":"ZZZ9"},999,999,null,null,999]
[147,null,null,null,null,null,null,null,null,{"$f":"IF(AND(Q153=\"\",#REF!>0,#REF!<5),K153,)","v":{"$error":"#REF!"}},{"$f":"IF(D153=\"\",\"ZZZ9\",IF(AND(#REF!>0,#REF!<5),D153&#REF!,D153&\"9\"))","v":"ZZZ9"},999,999,null,null,999]
[148,null,null,null,null,null,null,null,null,{"$f":"IF(AND(Q154=\"\",#REF!>0,#REF!<5),K154,)","v":{"$error":"#REF!"}},{"$f":"IF(D154=\"\",\"ZZZ9\",IF(AND(#REF!>0,#REF!<5),D154&#REF!,D154&\"9\"))","v":"ZZZ9"},999,999,null,null,999]
[149,null,null,null,null,null,null,null,null,{"$f":"IF(AND(Q155=\"\",#REF!>0,#REF!<5),K155,)","v":{"$error":"#REF!"}},{"$f":"IF(D155=\"\",\"ZZZ9\",IF(AND(#REF!>0,#REF!<5),D155&#REF!,D155&\"9\"))","v":"ZZZ9"},999,999,null,null,999]
[150,null,null,null,null,null,null,null,null,{"$f":"IF(AND(Q156=\"\",#REF!>0,#REF!<5),K156,)","v":{"$error":"#REF!"}},{"$f":"IF(D156=\"\",\"ZZZ9\",IF(AND(#REF!>0,#REF!<5),D156&#REF!,D156&\"9\"))","v":"ZZZ9"},999,999,null,null,999]

{"sheet":"1E5 (4)","index":6,"n_rows":41,"n_cols":37,"rows_kept":41,"cut":false,"hidden":false,"merged":[[0,0,0,5],[3,0,3,2],[6,4,6,5],[6,6,6,7],[8,4,8,5],[8,6,8,7],[10,4,10,5],[10,6,10,7],[12,4,12,5],[12,6,12,7],[14,4,14,5],[14,6,14,7],[17,1,17,2],[17,3,17,4],[17,5,17,6],[17,7,17,8],[17,9,17,10],[17,11,17,12],[18,1,18,2],[18,3,18,4],[18,5,18,6],[18,7,18,8],[18,9,18,10],[18,11,18,12],[19,1,19,2],[19,3,19,4],[19,5,19,6],[19,7,19,8],[19,9,19,10],[19,11,19,12],[20,1,20,2],[20,3,20,4],[20,5,20,6],[20,7,20,8],[20,9,20,10],[20,11,20,12],[22,9,22,10],[22,11,22,12],[21,1,21,2],[21,3,21,4],[21,5,21,6],[21,7,21,8],[21,9,21,10],[21,11,21,12],[33,4,33,5],[34,4,34,5],[22,1,22,2],[22,3,22,4],[22,5,22,6],[22,7,22,8]]}
[{"$f":"Altalanos!$A$6","v":"Diákolimpia Orsz. Döntő"},null,null,null,null,null,null,"Egyéni főtábla",null,null,null,null,null,null,"",null,null,null,null,null,null,null,null,null,null,null,null,{"$f":"IF(Y5=1,CONCATENATE(VLOOKUP(Y3,AA16:AH27,2)),CONCATENATE(VLOOKUP(Y3,AA2:AK13,2)))","v":{"$error":"#N/A"}},{"$f":"IF(Y5=1,CONCATENATE(VLOOKUP(Y3,AA16:AK27,3)),CONCATENATE(VLOOKUP(Y3,AA2:AK13,3)))","v":{"$error":"#N/A"}},{"$f":"IF(Y5=1,CONCATENATE(VLOOKUP(Y3,AA16:AK27,4)),CONCATENATE(VLOOKUP(Y3,AA2:AK13,4)))","v":{"$error":"#N/A"}},{"$f":"IF(Y5=1,CONCATENATE(VLOOKUP(Y3,AA16:AK27,5)),CONCATENATE(VLOOKUP(Y3,AA2:AK13,5)))","v":{"$error":"#N/A"}},{"$f":"IF(Y5=1,CONCATENATE(VLOOKUP(Y3,AA16:AK27,6)),CONCATENATE(VLOOKUP(Y3,AA2:AK13,6)))","v":{"$error":"#N/A"}},{"$f":"IF(Y5=1,CONCATENATE(VLOOKUP(Y3,AA16:AK27,7)),CONCATENATE(VLOOKUP(Y3,AA2:AK13,7)))","v":{"$error":"#N/A"}},{"$f":"IF(Y5=1,CONCATENATE(VLOOKUP(Y3,AA16:AK27,8)),CONCATENATE(VLOOKUP(Y3,AA2:AK13,8)))","v":{"$error":"#N/A"}},{"$f":"IF(Y5=1,CONCATENATE(VLOOKUP(Y3,AA16:AK27,9)),CONCATENATE(VLOOKUP(Y3,AA2:AK13,9)))","v":{"$error":"#N/A"}},{"$f":"IF(Y5=1,CONCATENATE(VLOOKUP(Y3,AA16:AK27,10)),CONCATENATE(VLOOKUP(Y3,AA2:AK13,10)))","v":{"$error":"#N/A"}},{"$f":"IF(Y5=1,CONCATENATE(VLOOKUP(Y3,AA16:AK27,11)),CONCATENATE(VLOOKUP(Y3,AA2:AK13,11)))","v":{"$error":"#N/A"}}]
["Versenyszám:",null,null,null,{"$f":"Altalanos!$D$8","v":"Nrancs lány"},null,null,null,null,null,null,null,null,null,null,null,null,null,null,null,null,null,null,null,null,null,"A",150,120,100,80,70,60,55,50,45,40]
["Dátum",null,null,null,"Város",null,null,"Kategória",null,null,null,"Versenybíró",null,null,null,null,null,null,null,null,null,null,null,null,{"$f":"IF(H4=\"OB\",\"A\",IF(H4=\"IX\",\"W\",H4))","v":0},null,"I",120,90,65,55,50,45,40,35,25,20]
[{"$f":"Altalanos!$A$10","v":"2018.05.28-31."},null,null,null,{"$f":"Altalanos!$C$10","v":"Balatonboglár"},null,null,null,null,null,null,{"$f":"Altalanos!$E$10","v":"Rákóczi Andrea"},null,null,null,"1 FORDULÓ","B - E","C - D",null,null,null,null,null,null,null,null,"II",90,60,45,34,27,22,18,15,12,9]
[null,"kiem","kódszám","Rangsor","Vezetéknév",null,"Keresztnév",null,"Egyesület",null,"Helyezés","Pontszám","Bónusz",null,null,"2 FORDULÓ","D - B","E - A",null,null,null,null,null,null,{"$f":"IF(OR(Altalanos!$A$8=\"F1\",Altalanos!$A$8=\"F2\",Altalanos!$A$8=\"N1\",Altalanos!$A$8=\"N2\"),1,2)","v":2},null,"III",60,40,30,20,18,15,12,10,8,6]
[null,null,null,null,null,null,null,null,null,null,null,null,null,null,null,"3 FORDULÓ","A - D","B - C",null,null,null,null,null,null,null,null,"IV",40,25,18,13,10,8,6,5,4,3]
["A",2,{"$f":"IF($B7=\"\",\"\",VLOOKUP($B7,'narancs lány elo'!$A$7:$O$22,5))","v":0},{"$f":"IF($B7=\"\",\"\",VLOOKUP($B7,'narancs lány elo'!$A$7:$O$22,15))","v":0},"Kodály Zoltán Éz. Ált.Isk.",null,{"$f":"IF($B7=\"\",\"\",VLOOKUP($B7,'narancs lány elo'!$A$7:$O$22,3))","v":0},null,"Szombathely",null,"IV.",null,null,null,null,"4 FORDULÓ","C - A","D - E",null,null,null,null,null,null,null,null,"V",25,15,13,8,6,4,3,2,1,0]
[null,null,null,null,null,null,null,null,null,null,null,null,null,null,null,"5 FORDULÓ","A - B","E - C",null,null,null,null,null,null,null,null,"VI",15,10,7,5,4,3,2,1,0,0]
["B",4,{"$f":"IF($B9=\"\",\"\",VLOOKUP($B9,'narancs lány elo'!$A$7:$O$22,5))","v":0},{"$f":"IF($B9=\"\",\"\",VLOOKUP($B9,'narancs lány elo'!$A$7:$O$22,15))","v":0},"Széchelyi István Ált.Isk.",null,{"$f":"IF($B9=\"\",\"\",VLOOKUP($B9,'narancs lány elo'!$A$7:$O$22,3))","v":0},null,{"$f":"IF($B9=\"\",\"\",VLOOKUP($B9,'narancs lány elo'!$A$7:$O$22,4))","v":"Siófok"},null,"III.",null,null,null,null,null,null,null,null,null,null,null,null,null,null,null,"VII",10,6,4,2,1,0,0,0,0,0]
[null,null,null,null,null,null,null,null,null,null,null,null,null,null,null,null,null,null,null,null,null,null,null,null,null,null,"VIII",6,3,2,1,0,0,0,0,0,0]
["C",5,{"$f":"IF($B11=\"\",\"\",VLOOKUP($B11,'narancs lány elo'!$A$7:$O$22,5))","v":0},{"$f":"IF($B11=\"\",\"\",VLOOKUP($B11,'narancs lány elo'!$A$7:$O$22,15))","v":0},"II. Rákóczi F. Ált Isk és G.",null,{"$f":"IF($B11=\"\",\"\",VLOOKUP($B11,'narancs lány elo'!$A$7:$O$22,3))","v":0},null,{"$f":"IF($B11=\"\",\"\",VLOOKUP($B11,'narancs lány elo'!$A$7:$O$22,4))","v":"Szentendre"},null,null,null,null,null,null,null,null,null,null,null,null,null,null,null,null,null,"W",3,2,1,0,0,0,0,0,0,0]
[null,null,null,null,null,null,null,null,null,null,null,null,null,null,null,null,null,null,null,null,null,null,null,null,null,null,"X",0,0,0,0,0,0,0,0,0,0]
["D",1,{"$f":"IF($B13=\"\",\"\",VLOOKUP($B13,'narancs lány elo'!$A$7:$O$22,5))","v":0},{"$f":"IF($B13=\"\",\"\",VLOOKUP($B13,'narancs lány elo'!$A$7:$O$22,15))","v":0},"Gothard J.Ált.Isk.",null,{"$f":"IF($B13=\"\",\"\",VLOOKUP($B13,'narancs lány elo'!$A$7:$O$22,3))","v":0},null,{"$f":"IF($B13=\"\",\"\",VLOOKUP($B13,'narancs lány elo'!$A$7:$O$22,4))","v":"Szombathely"},null,"I.",null,null,null,null,null,null,null,null,null,null,null,null,null,null,null,"XI",0,0,0,0,0,0,0,0,0,0]
[]
["E",3,{"$f":"IF($B15=\"\",\"\",VLOOKUP($B15,'narancs lány elo'!$A$7:$O$22,5))","v":0},{"$f":"IF($B15=\"\",\"\",VLOOKUP($B15,'narancs lány elo'!$A$7:$O$22,15))","v":0},"Bártfa Utcai Ált.Isk.",null,{"$f":"IF($B15=\"\",\"\",VLOOKUP($B15,'narancs lány elo'!$A$7:$O$22,3))","v":0},null,{"$f":"IF($B15=\"\",\"\",VLOOKUP($B15,'narancs lány elo'!$A$7:$O$22,4))","v":"Pécs"},null,"II."]
[null,null,null,null,null,null,null,null,null,null,null,null,null,null,null,null,null,null,null,null,null,null,null,null,null,null,"A",300,250,220,180,160,150,140,130,120,110]
[null,null,null,null,null,null,null,null,null,null,null,null,null,null,null,null,null,null,null,null,null,null,null,null,null,null,"I",250,200,160,140,120,110,100,90,80,70]
[null,null,null,{"$f":"E7","v":"Kodály Zoltán Éz. Ált.Isk."},null,{"$f":"E9","v":"Széchelyi István Ált.Isk."},null,{"$f":"E11","v":"II. Rákóczi F. Ált Isk és G."},null,{"$f":"E13","v":"Gothard J.Ált.Isk."},null,{"$f":"E15","v":"Bártfa Utcai Ált.Isk."},null,null,null,null,null,null,null,null,null,null,null,null,null,null,"II",200,150,130,110,95,80,70,60,55,50]
["A",{"$f":"E7","v":"Kodály Zoltán Éz. Ált.Isk."},null,null,null,"18/20",null,"jn.",null,"0/2",null,"0/2",null,null,null,null,null,null,null,null,null,null,null,null,null,null,"III",150,120,100,80,70,60,55,50,45,40]
["B",{"$f":"E9","v":"Széchelyi István Ált.Isk."},null,"20/18",null,null,null,"jn.",null,"0/2",null,"0/2",null,null,null,null,null,null,null,null,null,null,null,null,null,null,"IV",120,90,65,55,50,45,40,35,25,20]
["C",{"$f":"E11","v":"II. Rákóczi F. Ált Isk és G."},null,"jn",null,"jn",null,null,null,"jn",null,"jn.",null,null,null,null,null,null,null,null,null,null,null,null,null,null,"V",90,60,45,34,27,22,18,15,12,9]
["D",{"$f":"E13","v":"Gothard J.Ált.Isk."},null,"2/0",null,"2/0",null,"jn.",null,null,null,"2/0",null,null,null,null,null,null,null,null,null,null,null,null,null,null,"VI",60,40,30,20,18,15,12,10,8,6]
["E",{"$f":"E15","v":"Bártfa Utcai Ált.Isk."},null,"2/0",null,"2/0",null,"jn.",null,"0/2",null,null,null,null,null,null,null,null,null,null,null,null,null,null,null,null,"VII",40,25,18,13,8,7,6,5,4,3]
[null,null,null,null,null,null,null,null,null,null,null,null,null,null,null,null,null,null,null,null,null,null,null,null,null,null,"VIII",25,15,13,7,6,5,4,3,2,1]
[null,null,null,null,null,null,null,null,null,null,null,null,null,null,null,null,null,null,null,null,null,null,null,null,null,null,"W",15,10,8,4,3,2,1,0,0,0]
[null,null,null,null,null,null,null,null,null,null,null,null,null,null,null,null,null,null,null,null,null,null,null,null,null,null,"X",10,6,4,2,1,0,0,0,0,0]
[null,null,null,null,null,null,null,null,null,null,null,null,null,null,null,null,null,null,null,null,null,null,null,null,null,null,"XI",3,2,1,0,0,0,0,0,0,0]
[]
[]
[]
[]
[]
["Rangsor",null,null,"#","Kiemeltek",null,"#","Szerencés Vesztes",null,"Helyettesíti","Sorsolás időpontja"]
["Dátuma",null,null,null,null,null,"1",null,null,null,"Utolsó elfogadott játékos"]
["Utolsó DA",null,null,null,null,null,"2"]
[null,null,null,null,null,null,"3",null,null,null,"Sorsoló játékosok"]
[null,null,null,null,null,null,"4"]
[null,null,null,null,null,null,"5"]
[null,null,null,null,null,null,"6",null,null,null,"Versenybíró aláírása"]
[null,null,null,null,null,null,"7"]
[null,null,null,null,null,null,"8",null,null,null,{"$f":"L4","v":"Rákóczi Andrea"}]

{"sheet":"Zőld lány elo","index":7,"n_rows":156,"n_cols":17,"rows_kept":156,"cut":false,"hidden":false,"merged":[]}
[{"$f":"Altalanos!$A$6","v":"Diákolimpia Orsz. Döntő"},null,null,null,"Egyéni főtábla"]
[null,"Versenyszám:",{"$f":"Altalanos!$C$8","v":"Zöld lány"},null,"ELŐKÉSZÍTŐ LISTA"]
["NE TÖRÖLD KI EZT AZ OLDALT!     ",null,null,null,null,null,null,null,null,null,null,null,null,"Versenybíró aláírása"]
["Dátum",null,"Város","Kategória",null,null,null,"Versenybíró"]
[{"$f":"Altalanos!$A$10","v":"2018.05.28-31."},null,{"$f":"Altalanos!$C$10","v":"Balatonboglár"},{"$f":"Altalanos!$D$10","v":"  "},null,null,null,{"$f":"Altalanos!$E$10","v":"Rákóczi Andrea"}]
["Sor","Családi név","Keresztnév","Egyesület","Kódszám","Nevezett Igen","Aláírás","Nevezési rangsor",null,"NatSort\nif not \nSeed","NatSort","Seed Sort","AccBasic","Elfogadási státusz","Sorsolási rangsor","AccSort","Kiemelés"]
[1,"Fazekas Mihály Német Nyelvoktató Nemzetiségi Ált. Isk.",null,"Dunakeszi"]
[2,"Gothard Jenő Általános Iskola",null,"Szombathely"]
[3,"Győri Nádorvárosi Ének-zenei Általános Iskola",null,"Győr"]
[4,"Gyulai Implom József Általános Iskola",null,"Gyula"]
[5,"Kazincbarcikai Pollack Mihály Általános Iskola",null,"Kazincbarcika"]
[6]
[7]
[8]
[9]
[10]
[11]
[12]
[13]
[14]
[15]
[16]
[17]
[18]
[19]
[20]
[21]
[22]
[23]
[24]
[25]
[26]
[27]
[28]
[29]
[30]
[31]
[32]
[33]
[34,null,null,null,null,null,null,null,null,{"$f":"IF(AND(Q40=\"\",#REF!>0,#REF!<5),K40,)","v":{"$error":"#REF!"}},{"$f":"IF(D40=\"\",\"ZZZ9\",IF(AND(#REF!>0,#REF!<5),D40&#REF!,D40&\"9\"))","v":"ZZZ9"},{"$f":"IF(Q40=\"\",999,Q40)","v":999},{"$f":"IF(P40=999,999,1)","v":999},null,null,{"$f":"IF(N40=\"DA\",1,IF(N40=\"WC\",2,IF(N40=\"SE\",3,IF(N40=\"Q\",4,IF(N40=\"LL\",5,999)))))","v":999}]
[35,null,null,null,null,null,null,null,null,{"$f":"IF(AND(Q41=\"\",#REF!>0,#REF!<5),K41,)","v":{"$error":"#REF!"}},{"$f":"IF(D41=\"\",\"ZZZ9\",IF(AND(#REF!>0,#REF!<5),D41&#REF!,D41&\"9\"))","v":"ZZZ9"},999,999,null,null,999]
[36,null,null,null,null,null,null,null,null,{"$f":"IF(AND(Q42=\"\",#REF!>0,#REF!<5),K42,)","v":{"$error":"#REF!"}},{"$f":"IF(D42=\"\",\"ZZZ9\",IF(AND(#REF!>0,#REF!<5),D42&#REF!,D42&\"9\"))","v":"ZZZ9"},999,999,null,null,999]
[37,null,null,null,null,null,null,null,null,{"$f":"IF(AND(Q43=\"\",#REF!>0,#REF!<5),K43,)","v":{"$error":"#REF!"}},{"$f":"IF(D43=\"\",\"ZZZ9\",IF(AND(#REF!>0,#REF!<5),D43&#REF!,D43&\"9\"))","v":"ZZZ9"},999,999,null,null,999]
[38,null,null,null,null,null,null,null,null,{"$f":"IF(AND(Q44=\"\",#REF!>0,#REF!<5),K44,)","v":{"$error":"#REF!"}},{"$f":"IF(D44=\"\",\"ZZZ9\",IF(AND(#REF!>0,#REF!<5),D44&#REF!,D44&\"9\"))","v":"ZZZ9"},999,999,null,null,999]
[39,null,null,null,null,null,null,null,null,{"$f":"IF(AND(Q45=\"\",#REF!>0,#REF!<5),K45,)","v":{"$error":"#REF!"}},{"$f":"IF(D45=\"\",\"ZZZ9\",IF(AND(#REF!>0,#REF!<5),D45&#REF!,D45&\"9\"))","v":"ZZZ9"},999,999,null,null,999]
[40,null,null,null,null,null,null,null,null,{"$f":"IF(AND(Q46=\"\",#REF!>0,#REF!<5),K46,)","v":{"$error":"#REF!"}},{"$f":"IF(D46=\"\",\"ZZZ9\",IF(AND(#REF!>0,#REF!<5),D46&#REF!,D46&\"9\"))","v":"ZZZ9"},999,999,null,null,999]
[41,null,null,null,null,null,null,null,null,{"$f":"IF(AND(Q47=\"\",#REF!>0,#REF!<5),K47,)","v":{"$error":"#REF!"}},{"$f":"IF(D47=\"\",\"ZZZ9\",IF(AND(#REF!>0,#REF!<5),D47&#REF!,D47&\"9\"))","v":"ZZZ9"},999,999,null,null,999]
[42,null,null,null,null,null,null,null,null,{"$f":"IF(AND(Q48=\"\",#REF!>0,#REF!<5),K48,)","v":{"$error":"#REF!"}},{"$f":"IF(D48=\"\",\"ZZZ9\",IF(AND(#REF!>0,#REF!<5),D48&#REF!,D48&\"9\"))","v":"ZZZ9"},999,999,null,null,999]
[43,null,null,null,null,null,null,null,null,{"$f":"IF(AND(Q49=\"\",#REF!>0,#REF!<5),K49,)","v":{"$error":"#REF!"}},{"$f":"IF(D49=\"\",\"ZZZ9\",IF(AND(#REF!>0,#REF!<5),D49&#REF!,D49&\"9\"))","v":"ZZZ9"},999,999,null,null,999]
[44,null,null,null,null,null,null,null,null,{"$f":"IF(AND(Q50=\"\",#REF!>0,#REF!<5),K50,)","v":{"$error":"#REF!"}},{"$f":"IF(D50=\"\",\"ZZZ9\",IF(AND(#REF!>0,#REF!<5),D50&#REF!,D50&\"9\"))","v":"ZZZ9"},999,999,null,null,999]
[45,null,null,null,null,null,null,null,null,{"$f":"IF(AND(Q51=\"\",#REF!>0,#REF!<5),K51,)","v":{"$error":"#REF!"}},{"$f":"IF(D51=\"\",\"ZZZ9\",IF(AND(#REF!>0,#REF!<5),D51&#REF!,D51&\"9\"))","v":"ZZZ9"},999,999,null,null,999]
[46,null,null,null,null,null,null,null,null,{"$f":"IF(AND(Q52=\"\",#REF!>0,#REF!<5),K52,)","v":{"$error":"#REF!"}},{"$f":"IF(D52=\"\",\"ZZZ9\",IF(AND(#REF!>0,#REF!<5),D52&#REF!,D52&\"9\"))","v":"ZZZ9"},999,999,null,null,999]
[47,null,null,null,null,null,null,null,null,{"$f":"IF(AND(Q53=\"\",#REF!>0,#REF!<5),K53,)","v":{"$error":"#REF!"}},{"$f":"IF(D53=\"\",\"ZZZ9\",IF(AND(#REF!>0,#REF!<5),D53&#REF!,D53&\"9\"))","v":"ZZZ9"},999,999,null,null,999]
[48,null,null,null,null,null,null,null,null,{"$f":"IF(AND(Q54=\"\",#REF!>0,#REF!<5),K54,)","v":{"$error":"#REF!"}},{"$f":"IF(D54=\"\",\"ZZZ9\",IF(AND(#REF!>0,#REF!<5),D54&#REF!,D54&\"9\"))","v":"ZZZ9"},999,999,null,null,999]
[49,null,null,null,null,null,null,null,null,{"$f":"IF(AND(Q55=\"\",#REF!>0,#REF!<5),K55,)","v":{"$error":"#REF!"}},{"$f":"IF(D55=\"\",\"ZZZ9\",IF(AND(#REF!>0,#REF!<5),D55&#REF!,D55&\"9\"))","v":"ZZZ9"},999,999,null,null,999]
[50,null,null,null,null,null,null,null,null,{"$f":"IF(AND(Q56=\"\",#REF!>0,#REF!<5),K56,)","v":{"$error":"#REF!"}},{"$f":"IF(D56=\"\",\"ZZZ9\",IF(AND(#REF!>0,#REF!<5),D56&#REF!,D56&\"9\"))","v":"ZZZ9"},999,999,null,null,999]
[51,null,null,null,null,null,null,null,null,{"$f":"IF(AND(Q57=\"\",#REF!>0,#REF!<5),K57,)","v":{"$error":"#REF!"}},{"$f":"IF(D57=\"\",\"ZZZ9\",IF(AND(#REF!>0,#REF!<5),D57&#REF!,D57&\"9\"))","v":"ZZZ9"},999,999,null,null,999]
[52,null,null,null,null,null,null,null,null,{"$f":"IF(AND(Q58=\"\",#REF!>0,#REF!<5),K58,)","v":{"$error":"#REF!"}},{"$f":"IF(D58=\"\",\"ZZZ9\",IF(AND(#REF!>0,#REF!<5),D58&#REF!,D58&\"9\"))","v":"ZZZ9"},999,999,null,null,999]
[53,null,null,null,null,null,null,null,null,{"$f":"IF(AND(Q59=\"\",#REF!>0,#REF!<5),K59,)","v":{"$error":"#REF!"}},{"$f":"IF(D59=\"\",\"ZZZ9\",IF(AND(#REF!>0,#REF!<5),D59&#REF!,D59&\"9\"))","v":"ZZZ9"},999,999,null,null,999]
[54,null,null,null,null,null,null,null,null,{"$f":"IF(AND(Q60=\"\",#REF!>0,#REF!<5),K60,)","v":{"$error":"#REF!"}},{"$f":"IF(D60=\"\",\"ZZZ9\",IF(AND(#REF!>0,#REF!<5),D60&#REF!,D60&\"9\"))","v":"ZZZ9"},999,999,null,null,999]
[55,null,null,null,null,null,null,null,null,{"$f":"IF(AND(Q61=\"\",#REF!>0,#REF!<5),K61,)","v":{"$error":"#REF!"}},{"$f":"IF(D61=\"\",\"ZZZ9\",IF(AND(#REF!>0,#REF!<5),D61&#REF!,D61&\"9\"))","v":"ZZZ9"},999,999,null,null,999]
[56,null,null,null,null,null,null,null,null,{"$f":"IF(AND(Q62=\"\",#REF!>0,#REF!<5),K62,)","v":{"$error":"#REF!"}},{"$f":"IF(D62=\"\",\"ZZZ9\",IF(AND(#REF!>0,#REF!<5),D62&#REF!,D62&\"9\"))","v":"ZZZ9"},999,999,null,null,999]
[57,null,null,null,null,null,null,null,null,{"$f":"IF(AND(Q63=\"\",#REF!>0,#REF!<5),K63,)","v":{"$error":"#REF!"}},{"$f":"IF(D63=\"\",\"ZZZ9\",IF(AND(#REF!>0,#REF!<5),D63&#REF!,D63&\"9\"))","v":"ZZZ9"},999,999,null,null,999]
[58,null,null,null,null,null,null,null,null,{"$f":"IF(AND(Q64=\"\",#REF!>0,#REF!<5),K64,)","v":{"$error":"#REF!"}},{"$f":"IF(D64=\"\",\"ZZZ9\",IF(AND(#REF!>0,#REF!<5),D64&#REF!,D64&\"9\"))","v":"ZZZ9"},999,999,null,null,999]
[59,null,null,null,null,null,null,null,null,{"$f":"IF(AND(Q65=\"\",#REF!>0,#REF!<5),K65,)","v":{"$error":"#REF!"}},{"$f":"IF(D65=\"\",\"ZZZ9\",IF(AND(#REF!>0,#REF!<5),D65&#REF!,D65&\"9\"))","v":"ZZZ9"},999,999,null,null,999]
[60,null,null,null,null,null,null,null,null,{"$f":"IF(AND(Q66=\"\",#REF!>0,#REF!<5),K66,)","v":{"$error":"#REF!"}},{"$f":"IF(D66=\"\",\"ZZZ9\",IF(AND(#REF!>0,#REF!<5),D66&#REF!,D66&\"9\"))","v":"ZZZ9"},999,999,null,null,999]
[61,null,null,null,null,null,null,null,null,{"$f":"IF(AND(Q67=\"\",#REF!>0,#REF!<5),K67,)","v":{"$error":"#REF!"}},{"$f":"IF(D67=\"\",\"ZZZ9\",IF(AND(#REF!>0,#REF!<5),D67&#REF!,D67&\"9\"))","v":"ZZZ9"},999,999,null,null,999]
[62,null,null,null,null,null,null,null,null,{"$f":"IF(AND(Q68=\"\",#REF!>0,#REF!<5),K68,)","v":{"$error":"#REF!"}},{"$f":"IF(D68=\"\",\"ZZZ9\",IF(AND(#REF!>0,#REF!<5),D68&#REF!,D68&\"9\"))","v":"ZZZ9"},999,999,null,null,999]
[63,null,null,null,null,null,null,null,null,{"$f":"IF(AND(Q69=\"\",#REF!>0,#REF!<5),K69,)","v":{"$error":"#REF!"}},{"$f":"IF(D69=\"\",\"ZZZ9\",IF(AND(#REF!>0,#REF!<5),D69&#REF!,D69&\"9\"))","v":"ZZZ9"},999,999,null,null,999]
[64,null,null,null,null,null,null,null,null,{"$f":"IF(AND(Q70=\"\",#REF!>0,#REF!<5),K70,)","v":{"$error":"#REF!"}},{"$f":"IF(D70=\"\",\"ZZZ9\",IF(AND(#REF!>0,#REF!<5),D70&#REF!,D70&\"9\"))","v":"ZZZ9"},999,999,null,null,999]
[65,null,null,null,null,null,null,null,null,{"$f":"IF(AND(Q71=\"\",#REF!>0,#REF!<5),K71,)","v":{"$error":"#REF!"}},{"$f":"IF(D71=\"\",\"ZZZ9\",IF(AND(#REF!>0,#REF!<5),D71&#REF!,D71&\"9\"))","v":"ZZZ9"},999,999,null,null,999]
[66,null,null,null,null,null,null,null,null,{"$f":"IF(AND(Q72=\"\",#REF!>0,#REF!<5),K72,)","v":{"$error":"#REF!"}},{"$f":"IF(D72=\"\",\"ZZZ9\",IF(AND(#REF!>0,#REF!<5),D72&#REF!,D72&\"9\"))","v":"ZZZ9"},999,999,null,null,999]
[67,null,null,null,null,null,null,null,null,{"$f":"IF(AND(Q73=\"\",#REF!>0,#REF!<5),K73,)","v":{"$error":"#REF!"}},{"$f":"IF(D73=\"\",\"ZZZ9\",IF(AND(#REF!>0,#REF!<5),D73&#REF!,D73&\"9\"))","v":"ZZZ9"},999,999,null,null,999]
[68,null,null,null,null,null,null,null,null,{"$f":"IF(AND(Q74=\"\",#REF!>0,#REF!<5),K74,)","v":{"$error":"#REF!"}},{"$f":"IF(D74=\"\",\"ZZZ9\",IF(AND(#REF!>0,#REF!<5),D74&#REF!,D74&\"9\"))","v":"ZZZ9"},999,999,null,null,999]
[69,null,null,null,null,null,null,null,null,{"$f":"IF(AND(Q75=\"\",#REF!>0,#REF!<5),K75,)","v":{"$error":"#REF!"}},{"$f":"IF(D75=\"\",\"ZZZ9\",IF(AND(#REF!>0,#REF!<5),D75&#REF!,D75&\"9\"))","v":"ZZZ9"},999,999,null,null,999]
[70,null,null,null,null,null,null,null,null,{"$f":"IF(AND(Q76=\"\",#REF!>0,#REF!<5),K76,)","v":{"$error":"#REF!"}},{"$f":"IF(D76=\"\",\"ZZZ9\",IF(AND(#REF!>0,#REF!<5),D76&#REF!,D76&\"9\"))","v":"ZZZ9"},999,999,null,null,999]
[71,null,null,null,null,null,null,null,null,{"$f":"IF(AND(Q77=\"\",#REF!>0,#REF!<5),K77,)","v":{"$error":"#REF!"}},{"$f":"IF(D77=\"\",\"ZZZ9\",IF(AND(#REF!>0,#REF!<5),D77&#REF!,D77&\"9\"))","v":"ZZZ9"},999,999,null,null,999]
[72,null,null,null,null,null,null,null,null,{"$f":"IF(AND(Q78=\"\",#REF!>0,#REF!<5),K78,)","v":{"$error":"#REF!"}},{"$f":"IF(D78=\"\",\"ZZZ9\",IF(AND(#REF!>0,#REF!<5),D78&#REF!,D78&\"9\"))","v":"ZZZ9"},999,999,null,null,999]
[73,null,null,null,null,null,null,null,null,{"$f":"IF(AND(Q79=\"\",#REF!>0,#REF!<5),K79,)","v":{"$error":"#REF!"}},{"$f":"IF(D79=\"\",\"ZZZ9\",IF(AND(#REF!>0,#REF!<5),D79&#REF!,D79&\"9\"))","v":"ZZZ9"},999,999,null,null,999]
[74,null,null,null,null,null,null,null,null,{"$f":"IF(AND(Q80=\"\",#REF!>0,#REF!<5),K80,)","v":{"$error":"#REF!"}},{"$f":"IF(D80=\"\",\"ZZZ9\",IF(AND(#REF!>0,#REF!<5),D80&#REF!,D80&\"9\"))","v":"ZZZ9"},999,999,null,null,999]
[75,null,null,null,null,null,null,null,null,{"$f":"IF(AND(Q81=\"\",#REF!>0,#REF!<5),K81,)","v":{"$error":"#REF!"}},{"$f":"IF(D81=\"\",\"ZZZ9\",IF(AND(#REF!>0,#REF!<5),D81&#REF!,D81&\"9\"))","v":"ZZZ9"},999,999,null,null,999]
[76,null,null,null,null,null,null,null,null,{"$f":"IF(AND(Q82=\"\",#REF!>0,#REF!<5),K82,)","v":{"$error":"#REF!"}},{"$f":"IF(D82=\"\",\"ZZZ9\",IF(AND(#REF!>0,#REF!<5),D82&#REF!,D82&\"9\"))","v":"ZZZ9"},999,999,null,null,999]
[77,null,null,null,null,null,null,null,null,{"$f":"IF(AND(Q83=\"\",#REF!>0,#REF!<5),K83,)","v":{"$error":"#REF!"}},{"$f":"IF(D83=\"\",\"ZZZ9\",IF(AND(#REF!>0,#REF!<5),D83&#REF!,D83&\"9\"))","v":"ZZZ9"},999,999,null,null,999]
[78,null,null,null,null,null,null,null,null,{"$f":"IF(AND(Q84=\"\",#REF!>0,#REF!<5),K84,)","v":{"$error":"#REF!"}},{"$f":"IF(D84=\"\",\"ZZZ9\",IF(AND(#REF!>0,#REF!<5),D84&#REF!,D84&\"9\"))","v":"ZZZ9"},999,999,null,null,999]
[79,null,null,null,null,null,null,null,null,{"$f":"IF(AND(Q85=\"\",#REF!>0,#REF!<5),K85,)","v":{"$error":"#REF!"}},{"$f":"IF(D85=\"\",\"ZZZ9\",IF(AND(#REF!>0,#REF!<5),D85&#REF!,D85&\"9\"))","v":"ZZZ9"},999,999,null,null,999]
[80,null,null,null,null,null,null,null,null,{"$f":"IF(AND(Q86=\"\",#REF!>0,#REF!<5),K86,)","v":{"$error":"#REF!"}},{"$f":"IF(D86=\"\",\"ZZZ9\",IF(AND(#REF!>0,#REF!<5),D86&#REF!,D86&\"9\"))","v":"ZZZ9"},999,999,null,null,999]
[81,null,null,null,null,null,null,null,null,{"$f":"IF(AND(Q87=\"\",#REF!>0,#REF!<5),K87,)","v":{"$error":"#REF!"}},{"$f":"IF(D87=\"\",\"ZZZ9\",IF(AND(#REF!>0,#REF!<5),D87&#REF!,D87&\"9\"))","v":"ZZZ9"},999,999,null,null,999]
[82,null,null,null,null,null,null,null,null,{"$f":"IF(AND(Q88=\"\",#REF!>0,#REF!<5),K88,)","v":{"$error":"#REF!"}},{"$f":"IF(D88=\"\",\"ZZZ9\",IF(AND(#REF!>0,#REF!<5),D88&#REF!,D88&\"9\"))","v":"ZZZ9"},999,999,null,null,999]
[83,null,null,null,null,null,null,null,null,{"$f":"IF(AND(Q89=\"\",#REF!>0,#REF!<5),K89,)","v":{"$error":"#REF!"}},{"$f":"IF(D89=\"\",\"ZZZ9\",IF(AND(#REF!>0,#REF!<5),D89&#REF!,D89&\"9\"))","v":"ZZZ9"},999,999,null,null,999]
[84,null,null,null,null,null,null,null,null,{"$f":"IF(AND(Q90=\"\",#REF!>0,#REF!<5),K90,)","v":{"$error":"#REF!"}},{"$f":"IF(D90=\"\",\"ZZZ9\",IF(AND(#REF!>0,#REF!<5),D90&#REF!,D90&\"9\"))","v":"ZZZ9"},999,999,null,null,999]
[85,null,null,null,null,null,null,null,null,{"$f":"IF(AND(Q91=\"\",#REF!>0,#REF!<5),K91,)","v":{"$error":"#REF!"}},{"$f":"IF(D91=\"\",\"ZZZ9\",IF(AND(#REF!>0,#REF!<5),D91&#REF!,D91&\"9\"))","v":"ZZZ9"},999,999,null,null,999]
[86,null,null,null,null,null,null,null,null,{"$f":"IF(AND(Q92=\"\",#REF!>0,#REF!<5),K92,)","v":{"$error":"#REF!"}},{"$f":"IF(D92=\"\",\"ZZZ9\",IF(AND(#REF!>0,#REF!<5),D92&#REF!,D92&\"9\"))","v":"ZZZ9"},999,999,null,null,999]
[87,null,null,null,null,null,null,null,null,{"$f":"IF(AND(Q93=\"\",#REF!>0,#REF!<5),K93,)","v":{"$error":"#REF!"}},{"$f":"IF(D93=\"\",\"ZZZ9\",IF(AND(#REF!>0,#REF!<5),D93&#REF!,D93&\"9\"))","v":"ZZZ9"},999,999,null,null,999]
[88,null,null,null,null,null,null,null,null,{"$f":"IF(AND(Q94=\"\",#REF!>0,#REF!<5),K94,)","v":{"$error":"#REF!"}},{"$f":"IF(D94=\"\",\"ZZZ9\",IF(AND(#REF!>0,#REF!<5),D94&#REF!,D94&\"9\"))","v":"ZZZ9"},999,999,null,null,999]
[89,null,null,null,null,null,null,null,null,{"$f":"IF(AND(Q95=\"\",#REF!>0,#REF!<5),K95,)","v":{"$error":"#REF!"}},{"$f":"IF(D95=\"\",\"ZZZ9\",IF(AND(#REF!>0,#REF!<5),D95&#REF!,D95&\"9\"))","v":"ZZZ9"},999,999,null,null,999]
[90,null,null,null,null,null,null,null,null,{"$f":"IF(AND(Q96=\"\",#REF!>0,#REF!<5),K96,)","v":{"$error":"#REF!"}},{"$f":"IF(D96=\"\",\"ZZZ9\",IF(AND(#REF!>0,#REF!<5),D96&#REF!,D96&\"9\"))","v":"ZZZ9"},999,999,null,null,999]
[91,null,null,null,null,null,null,null,null,{"$f":"IF(AND(Q97=\"\",#REF!>0,#REF!<5),K97,)","v":{"$error":"#REF!"}},{"$f":"IF(D97=\"\",\"ZZZ9\",IF(AND(#REF!>0,#REF!<5),D97&#REF!,D97&\"9\"))","v":"ZZZ9"},999,999,null,null,999]
[92,null,null,null,null,null,null,null,null,{"$f":"IF(AND(Q98=\"\",#REF!>0,#REF!<5),K98,)","v":{"$error":"#REF!"}},{"$f":"IF(D98=\"\",\"ZZZ9\",IF(AND(#REF!>0,#REF!<5),D98&#REF!,D98&\"9\"))","v":"ZZZ9"},999,999,null,null,999]
[93,null,null,null,null,null,null,null,null,{"$f":"IF(AND(Q99=\"\",#REF!>0,#REF!<5),K99,)","v":{"$error":"#REF!"}},{"$f":"IF(D99=\"\",\"ZZZ9\",IF(AND(#REF!>0,#REF!<5),D99&#REF!,D99&\"9\"))","v":"ZZZ9"},999,999,null,null,999]
[94,null,null,null,null,null,null,null,null,{"$f":"IF(AND(Q100=\"\",#REF!>0,#REF!<5),K100,)","v":{"$error":"#REF!"}},{"$f":"IF(D100=\"\",\"ZZZ9\",IF(AND(#REF!>0,#REF!<5),D100&#REF!,D100&\"9\"))","v":"ZZZ9"},999,999,null,null,999]
[95,null,null,null,null,null,null,null,null,{"$f":"IF(AND(Q101=\"\",#REF!>0,#REF!<5),K101,)","v":{"$error":"#REF!"}},{"$f":"IF(D101=\"\",\"ZZZ9\",IF(AND(#REF!>0,#REF!<5),D101&#REF!,D101&\"9\"))","v":"ZZZ9"},999,999,null,null,999]
[96,null,null,null,null,null,null,null,null,{"$f":"IF(AND(Q102=\"\",#REF!>0,#REF!<5),K102,)","v":{"$error":"#REF!"}},{"$f":"IF(D102=\"\",\"ZZZ9\",IF(AND(#REF!>0,#REF!<5),D102&#REF!,D102&\"9\"))","v":"ZZZ9"},999,999,null,null,999]
[97,null,null,null,null,null,null,null,null,{"$f":"IF(AND(Q103=\"\",#REF!>0,#REF!<5),K103,)","v":{"$error":"#REF!"}},{"$f":"IF(D103=\"\",\"ZZZ9\",IF(AND(#REF!>0,#REF!<5),D103&#REF!,D103&\"9\"))","v":"ZZZ9"},999,999,null,null,999]
[98,null,null,null,null,null,null,null,null,{"$f":"IF(AND(Q104=\"\",#REF!>0,#REF!<5),K104,)","v":{"$error":"#REF!"}},{"$f":"IF(D104=\"\",\"ZZZ9\",IF(AND(#REF!>0,#REF!<5),D104&#REF!,D104&\"9\"))","v":"ZZZ9"},{"$f":"IF(Q104=\"\",999,Q104)","v":999},{"$f":"IF(P104=999,999,1)","v":999},null,null,{"$f":"IF(N104=\"DA\",1,IF(N104=\"WC\",2,IF(N104=\"SE\",3,IF(N104=\"Q\",4,IF(N104=\"LL\",5,999)))))","v":999}]
[99,null,null,null,null,null,null,null,null,{"$f":"IF(AND(Q105=\"\",#REF!>0,#REF!<5),K105,)","v":{"$error":"#REF!"}},{"$f":"IF(D105=\"\",\"ZZZ9\",IF(AND(#REF!>0,#REF!<5),D105&#REF!,D105&\"9\"))","v":"ZZZ9"},999,999,null,null,999]
[100,null,null,null,null,null,null,null,null,{"$f":"IF(AND(Q106=\"\",#REF!>0,#REF!<5),K106,)","v":{"$error":"#REF!"}},{"$f":"IF(D106=\"\",\"ZZZ9\",IF(AND(#REF!>0,#REF!<5),D106&#REF!,D106&\"9\"))","v":"ZZZ9"},999,999,null,null,999]
[101,null,null,null,null,null,null,null,null,{"$f":"IF(AND(Q107=\"\",#REF!>0,#REF!<5),K107,)","v":{"$error":"#REF!"}},{"$f":"IF(D107=\"\",\"ZZZ9\",IF(AND(#REF!>0,#REF!<5),D107&#REF!,D107&\"9\"))","v":"ZZZ9"},999,999,null,null,999]
[102,null,null,null,null,null,null,null,null,{"$f":"IF(AND(Q108=\"\",#REF!>0,#REF!<5),K108,)","v":{"$error":"#REF!"}},{"$f":"IF(D108=\"\",\"ZZZ9\",IF(AND(#REF!>0,#REF!<5),D108&#REF!,D108&\"9\"))","v":"ZZZ9"},999,999,null,null,999]
[103,null,null,null,null,null,null,null,null,{"$f":"IF(AND(Q109=\"\",#REF!>0,#REF!<5),K109,)","v":{"$error":"#REF!"}},{"$f":"IF(D109=\"\",\"ZZZ9\",IF(AND(#REF!>0,#REF!<5),D109&#REF!,D109&\"9\"))","v":"ZZZ9"},999,999,null,null,999]
[104,null,null,null,null,null,null,null,null,{"$f":"IF(AND(Q110=\"\",#REF!>0,#REF!<5),K110,)","v":{"$error":"#REF!"}},{"$f":"IF(D110=\"\",\"ZZZ9\",IF(AND(#REF!>0,#REF!<5),D110&#REF!,D110&\"9\"))","v":"ZZZ9"},999,999,null,null,999]
[105,null,null,null,null,null,null,null,null,{"$f":"IF(AND(Q111=\"\",#REF!>0,#REF!<5),K111,)","v":{"$error":"#REF!"}},{"$f":"IF(D111=\"\",\"ZZZ9\",IF(AND(#REF!>0,#REF!<5),D111&#REF!,D111&\"9\"))","v":"ZZZ9"},999,999,null,null,999]
[106,null,null,null,null,null,null,null,null,{"$f":"IF(AND(Q112=\"\",#REF!>0,#REF!<5),K112,)","v":{"$error":"#REF!"}},{"$f":"IF(D112=\"\",\"ZZZ9\",IF(AND(#REF!>0,#REF!<5),D112&#REF!,D112&\"9\"))","v":"ZZZ9"},999,999,null,null,999]
[107,null,null,null,null,null,null,null,null,{"$f":"IF(AND(Q113=\"\",#REF!>0,#REF!<5),K113,)","v":{"$error":"#REF!"}},{"$f":"IF(D113=\"\",\"ZZZ9\",IF(AND(#REF!>0,#REF!<5),D113&#REF!,D113&\"9\"))","v":"ZZZ9"},999,999,null,null,999]
[108,null,null,null,null,null,null,null,null,{"$f":"IF(AND(Q114=\"\",#REF!>0,#REF!<5),K114,)","v":{"$error":"#REF!"}},{"$f":"IF(D114=\"\",\"ZZZ9\",IF(AND(#REF!>0,#REF!<5),D114&#REF!,D114&\"9\"))","v":"ZZZ9"},999,999,null,null,999]
[109,null,null,null,null,null,null,null,null,{"$f":"IF(AND(Q115=\"\",#REF!>0,#REF!<5),K115,)","v":{"$error":"#REF!"}},{"$f":"IF(D115=\"\",\"ZZZ9\",IF(AND(#REF!>0,#REF!<5),D115&#REF!,D115&\"9\"))","v":"ZZZ9"},999,999,null,null,999]
[110,null,null,null,null,null,null,null,null,{"$f":"IF(AND(Q116=\"\",#REF!>0,#REF!<5),K116,)","v":{"$error":"#REF!"}},{"$f":"IF(D116=\"\",\"ZZZ9\",IF(AND(#REF!>0,#REF!<5),D116&#REF!,D116&\"9\"))","v":"ZZZ9"},999,999,null,null,999]
[111,null,null,null,null,null,null,null,null,{"$f":"IF(AND(Q117=\"\",#REF!>0,#REF!<5),K117,)","v":{"$error":"#REF!"}},{"$f":"IF(D117=\"\",\"ZZZ9\",IF(AND(#REF!>0,#REF!<5),D117&#REF!,D117&\"9\"))","v":"ZZZ9"},999,999,null,null,999]
[112,null,null,null,null,null,null,null,null,{"$f":"IF(AND(Q118=\"\",#REF!>0,#REF!<5),K118,)","v":{"$error":"#REF!"}},{"$f":"IF(D118=\"\",\"ZZZ9\",IF(AND(#REF!>0,#REF!<5),D118&#REF!,D118&\"9\"))","v":"ZZZ9"},999,999,null,null,999]
[113,null,null,null,null,null,null,null,null,{"$f":"IF(AND(Q119=\"\",#REF!>0,#REF!<5),K119,)","v":{"$error":"#REF!"}},{"$f":"IF(D119=\"\",\"ZZZ9\",IF(AND(#REF!>0,#REF!<5),D119&#REF!,D119&\"9\"))","v":"ZZZ9"},999,999,null,null,999]
[114,null,null,null,null,null,null,null,null,{"$f":"IF(AND(Q120=\"\",#REF!>0,#REF!<5),K120,)","v":{"$error":"#REF!"}},{"$f":"IF(D120=\"\",\"ZZZ9\",IF(AND(#REF!>0,#REF!<5),D120&#REF!,D120&\"9\"))","v":"ZZZ9"},999,999,null,null,999]
[115,null,null,null,null,null,null,null,null,{"$f":"IF(AND(Q121=\"\",#REF!>0,#REF!<5),K121,)","v":{"$error":"#REF!"}},{"$f":"IF(D121=\"\",\"ZZZ9\",IF(AND(#REF!>0,#REF!<5),D121&#REF!,D121&\"9\"))","v":"ZZZ9"},999,999,null,null,999]
[116,null,null,null,null,null,null,null,null,{"$f":"IF(AND(Q122=\"\",#REF!>0,#REF!<5),K122,)","v":{"$error":"#REF!"}},{"$f":"IF(D122=\"\",\"ZZZ9\",IF(AND(#REF!>0,#REF!<5),D122&#REF!,D122&\"9\"))","v":"ZZZ9"},999,999,null,null,999]
[117,null,null,null,null,null,null,null,null,{"$f":"IF(AND(Q123=\"\",#REF!>0,#REF!<5),K123,)","v":{"$error":"#REF!"}},{"$f":"IF(D123=\"\",\"ZZZ9\",IF(AND(#REF!>0,#REF!<5),D123&#REF!,D123&\"9\"))","v":"ZZZ9"},999,999,null,null,999]
[118,null,null,null,null,null,null,null,null,{"$f":"IF(AND(Q124=\"\",#REF!>0,#REF!<5),K124,)","v":{"$error":"#REF!"}},{"$f":"IF(D124=\"\",\"ZZZ9\",IF(AND(#REF!>0,#REF!<5),D124&#REF!,D124&\"9\"))","v":"ZZZ9"},999,999,null,null,999]
[119,null,null,null,null,null,null,null,null,{"$f":"IF(AND(Q125=\"\",#REF!>0,#REF!<5),K125,)","v":{"$error":"#REF!"}},{"$f":"IF(D125=\"\",\"ZZZ9\",IF(AND(#REF!>0,#REF!<5),D125&#REF!,D125&\"9\"))","v":"ZZZ9"},999,999,null,null,999]
[120,null,null,null,null,null,null,null,null,{"$f":"IF(AND(Q126=\"\",#REF!>0,#REF!<5),K126,)","v":{"$error":"#REF!"}},{"$f":"IF(D126=\"\",\"ZZZ9\",IF(AND(#REF!>0,#REF!<5),D126&#REF!,D126&\"9\"))","v":"ZZZ9"},999,999,null,null,999]
[121,null,null,null,null,null,null,null,null,{"$f":"IF(AND(Q127=\"\",#REF!>0,#REF!<5),K127,)","v":{"$error":"#REF!"}},{"$f":"IF(D127=\"\",\"ZZZ9\",IF(AND(#REF!>0,#REF!<5),D127&#REF!,D127&\"9\"))","v":"ZZZ9"},999,999,null,null,999]
[122,null,null,null,null,null,null,null,null,{"$f":"IF(AND(Q128=\"\",#REF!>0,#REF!<5),K128,)","v":{"$error":"#REF!"}},{"$f":"IF(D128=\"\",\"ZZZ9\",IF(AND(#REF!>0,#REF!<5),D128&#REF!,D128&\"9\"))","v":"ZZZ9"},999,999,null,null,999]
[123,null,null,null,null,null,null,null,null,{"$f":"IF(AND(Q129=\"\",#REF!>0,#REF!<5),K129,)","v":{"$error":"#REF!"}},{"$f":"IF(D129=\"\",\"ZZZ9\",IF(AND(#REF!>0,#REF!<5),D129&#REF!,D129&\"9\"))","v":"ZZZ9"},999,999,null,null,999]
[124,null,null,null,null,null,null,null,null,{"$f":"IF(AND(Q130=\"\",#REF!>0,#REF!<5),K130,)","v":{"$error":"#REF!"}},{"$f":"IF(D130=\"\",\"ZZZ9\",IF(AND(#REF!>0,#REF!<5),D130&#REF!,D130&\"9\"))","v":"ZZZ9"},999,999,null,null,999]
[125,null,null,null,null,null,null,null,null,{"$f":"IF(AND(Q131=\"\",#REF!>0,#REF!<5),K131,)","v":{"$error":"#REF!"}},{"$f":"IF(D131=\"\",\"ZZZ9\",IF(AND(#REF!>0,#REF!<5),D131&#REF!,D131&\"9\"))","v":"ZZZ9"},999,999,null,null,999]
[126,null,null,null,null,null,null,null,null,{"$f":"IF(AND(Q132=\"\",#REF!>0,#REF!<5),K132,)","v":{"$error":"#REF!"}},{"$f":"IF(D132=\"\",\"ZZZ9\",IF(AND(#REF!>0,#REF!<5),D132&#REF!,D132&\"9\"))","v":"ZZZ9"},999,999,null,null,999]
[127,null,null,null,null,null,null,null,null,{"$f":"IF(AND(Q133=\"\",#REF!>0,#REF!<5),K133,)","v":{"$error":"#REF!"}},{"$f":"IF(D133=\"\",\"ZZZ9\",IF(AND(#REF!>0,#REF!<5),D133&#REF!,D133&\"9\"))","v":"ZZZ9"},999,999,null,null,999]
[128,null,null,null,null,null,null,null,null,{"$f":"IF(AND(Q134=\"\",#REF!>0,#REF!<5),K134,)","v":{"$error":"#REF!"}},{"$f":"IF(D134=\"\",\"ZZZ9\",IF(AND(#REF!>0,#REF!<5),D134&#REF!,D134&\"9\"))","v":"ZZZ9"},999,999,null,null,999]
[129,null,null,null,null,null,null,null,null,{"$f":"IF(AND(Q135=\"\",#REF!>0,#REF!<5),K135,)","v":{"$error":"#REF!"}},{"$f":"IF(D135=\"\",\"ZZZ9\",IF(AND(#REF!>0,#REF!<5),D135&#REF!,D135&\"9\"))","v":"ZZZ9"},999,999,null,null,999]
[130,null,null,null,null,null,null,null,null,{"$f":"IF(AND(Q136=\"\",#REF!>0,#REF!<5),K136,)","v":{"$error":"#REF!"}},{"$f":"IF(D136=\"\",\"ZZZ9\",IF(AND(#REF!>0,#REF!<5),D136&#REF!,D136&\"9\"))","v":"ZZZ9"},999,999,null,null,999]
[131,null,null,null,null,null,null,null,null,{"$f":"IF(AND(Q137=\"\",#REF!>0,#REF!<5),K137,)","v":{"$error":"#REF!"}},{"$f":"IF(D137=\"\",\"ZZZ9\",IF(AND(#REF!>0,#REF!<5),D137&#REF!,D137&\"9\"))","v":"ZZZ9"},999,999,null,null,999]
[132,null,null,null,null,null,null,null,null,{"$f":"IF(AND(Q138=\"\",#REF!>0,#REF!<5),K138,)","v":{"$error":"#REF!"}},{"$f":"IF(D138=\"\",\"ZZZ9\",IF(AND(#REF!>0,#REF!<5),D138&#REF!,D138&\"9\"))","v":"ZZZ9"},999,999,null,null,999]
[133,null,null,null,null,null,null,null,null,{"$f":"IF(AND(Q139=\"\",#REF!>0,#REF!<5),K139,)","v":{"$error":"#REF!"}},{"$f":"IF(D139=\"\",\"ZZZ9\",IF(AND(#REF!>0,#REF!<5),D139&#REF!,D139&\"9\"))","v":"ZZZ9"},999,999,null,null,999]
[134,null,null,null,null,null,null,null,null,{"$f":"IF(AND(Q140=\"\",#REF!>0,#REF!<5),K140,)","v":{"$error":"#REF!"}},{"$f":"IF(D140=\"\",\"ZZZ9\",IF(AND(#REF!>0,#REF!<5),D140&#REF!,D140&\"9\"))","v":"ZZZ9"},999,999,null,null,999]
[135,null,null,null,null,null,null,null,null,{"$f":"IF(AND(Q141=\"\",#REF!>0,#REF!<5),K141,)","v":{"$error":"#REF!"}},{"$f":"IF(D141=\"\",\"ZZZ9\",IF(AND(#REF!>0,#REF!<5),D141&#REF!,D141&\"9\"))","v":"ZZZ9"},999,999,null,null,999]
[136,null,null,null,null,null,null,null,null,{"$f":"IF(AND(Q142=\"\",#REF!>0,#REF!<5),K142,)","v":{"$error":"#REF!"}},{"$f":"IF(D142=\"\",\"ZZZ9\",IF(AND(#REF!>0,#REF!<5),D142&#REF!,D142&\"9\"))","v":"ZZZ9"},999,999,null,null,999]
[137,null,null,null,null,null,null,null,null,{"$f":"IF(AND(Q143=\"\",#REF!>0,#REF!<5),K143,)","v":{"$error":"#REF!"}},{"$f":"IF(D143=\"\",\"ZZZ9\",IF(AND(#REF!>0,#REF!<5),D143&#REF!,D143&\"9\"))","v":"ZZZ9"},999,999,null,null,999]
[138,null,null,null,null,null,null,null,null,{"$f":"IF(AND(Q144=\"\",#REF!>0,#REF!<5),K144,)","v":{"$error":"#REF!"}},{"$f":"IF(D144=\"\",\"ZZZ9\",IF(AND(#REF!>0,#REF!<5),D144&#REF!,D144&\"9\"))","v":"ZZZ9"},999,999,null,null,999]
[139,null,null,null,null,null,null,null,null,{"$f":"IF(AND(Q145=\"\",#REF!>0,#REF!<5),K145,)","v":{"$error":"#REF!"}},{"$f":"IF(D145=\"\",\"ZZZ9\",IF(AND(#REF!>0,#REF!<5),D145&#REF!,D145&\"9\"))","v":"ZZZ9"},999,999,null,null,999]
[140,null,null,null,null,null,null,null,null,{"$f":"IF(AND(Q146=\"\",#REF!>0,#REF!<5),K146,)","v":{"$error":"#REF!"}},{"$f":"IF(D146=\"\",\"ZZZ9\",IF(AND(#REF!>0,#REF!<5),D146&#REF!,D146&\"9\"))","v":"ZZZ9"},999,999,null,null,999]
[141,null,null,null,null,null,null,null,null,{"$f":"IF(AND(Q147=\"\",#REF!>0,#REF!<5),K147,)","v":{"$error":"#REF!"}},{"$f":"IF(D147=\"\",\"ZZZ9\",IF(AND(#REF!>0,#REF!<5),D147&#REF!,D147&\"9\"))","v":"ZZZ9"},999,999,null,null,999]
[142,null,null,null,null,null,null,null,null,{"$f":"IF(AND(Q148=\"\",#REF!>0,#REF!<5),K148,)","v":{"$error":"#REF!"}},{"$f":"IF(D148=\"\",\"ZZZ9\",IF(AND(#REF!>0,#REF!<5),D148&#REF!,D148&\"9\"))","v":"ZZZ9"},999,999,null,null,999]
[143,null,null,null,null,null,null,null,null,{"$f":"IF(AND(Q149=\"\",#REF!>0,#REF!<5),K149,)","v":{"$error":"#REF!"}},{"$f":"IF(D149=\"\",\"ZZZ9\",IF(AND(#REF!>0,#REF!<5),D149&#REF!,D149&\"9\"))","v":"ZZZ9"},999,999,null,null,999]
[144,null,null,null,null,null,null,null,null,{"$f":"IF(AND(Q150=\"\",#REF!>0,#REF!<5),K150,)","v":{"$error":"#REF!"}},{"$f":"IF(D150=\"\",\"ZZZ9\",IF(AND(#REF!>0,#REF!<5),D150&#REF!,D150&\"9\"))","v":"ZZZ9"},999,999,null,null,999]
[145,null,null,null,null,null,null,null,null,{"$f":"IF(AND(Q151=\"\",#REF!>0,#REF!<5),K151,)","v":{"$error":"#REF!"}},{"$f":"IF(D151=\"\",\"ZZZ9\",IF(AND(#REF!>0,#REF!<5),D151&#REF!,D151&\"9\"))","v":"ZZZ9"},999,999,null,null,999]
[146,null,null,null,null,null,null,null,null,{"$f":"IF(AND(Q152=\"\",#REF!>0,#REF!<5),K152,)","v":{"$error":"#REF!"}},{"$f":"IF(D152=\"\",\"ZZZ9\",IF(AND(#REF!>0,#REF!<5),D152&#REF!,D152&\"9\"))","v":"ZZZ9"},999,999,null,null,999]
[147,null,null,null,null,null,null,null,null,{"$f":"IF(AND(Q153=\"\",#REF!>0,#REF!<5),K153,)","v":{"$error":"#REF!"}},{"$f":"IF(D153=\"\",\"ZZZ9\",IF(AND(#REF!>0,#REF!<5),D153&#REF!,D153&\"9\"))","v":"ZZZ9"},999,999,null,null,999]
[148,null,null,null,null,null,null,null,null,{"$f":"IF(AND(Q154=\"\",#REF!>0,#REF!<5),K154,)","v":{"$error":"#REF!"}},{"$f":"IF(D154=\"\",\"ZZZ9\",IF(AND(#REF!>0,#REF!<5),D154&#REF!,D154&\"9\"))","v":"ZZZ9"},999,999,null,null,999]
[149,null,null,null,null,null,null,null,null,{"$f":"IF(AND(Q155=\"\",#REF!>0,#REF!<5),K155,)","v":{"$error":"#REF!"}},{"$f":"IF(D155=\"\",\"ZZZ9\",IF(AND(#REF!>0,#REF!<5),D155&#REF!,D155&\"9\"))","v":"ZZZ9"},999,999,null,null,999]
[150,null,null,null,null,null,null,null,null,{"$f":"IF(AND(Q156=\"\",#REF!>0,#REF!<5),K156,)","v":{"$error":"#REF!"}},{"$f":"IF(D156=\"\",\"ZZZ9\",IF(AND(#REF!>0,#REF!<5),D156&#REF!,D156&\"9\"))","v":"ZZZ9"},999,999,null,null,999]

{"sheet":"1E5 (3)","index":8,"n_rows":41,"n_cols":37,"rows_kept":41,"cut":false,"hidden":false,"merged":[[0,0,0,5],[3,0,3,2],[6,4,6,5],[6,6,6,7],[8,4,8,5],[8,6,8,7],[10,4,10,5],[10,6,10,7],[12,4,12,5],[12,6,12,7],[14,4,14,5],[14,6,14,7],[17,1,17,2],[17,3,17,4],[17,5,17,6],[17,7,17,8],[17,9,17,10],[17,11,17,12],[18,1,18,2],[18,3,18,4],[18,5,18,6],[18,7,18,8],[18,9,18,10],[18,11,18,12],[19,1,19,2],[19,3,19,4],[19,5,19,6],[19,7,19,8],[19,9,19,10],[19,11,19,12],[20,1,20,2],[20,3,20,4],[20,5,20,6],[20,7,20,8],[20,9,20,10],[20,11,20,12],[22,9,22,10],[22,11,22,12],[21,1,21,2],[21,3,21,4],[21,5,21,6],[21,7,21,8],[21,9,21,10],[21,11,21,12],[33,4,33,5],[34,4,34,5],[22,1,22,2],[22,3,22,4],[22,5,22,6],[22,7,22,8]]}
[{"$f":"Altalanos!$A$6","v":"Diákolimpia Orsz. Döntő"},null,null,null,null,null,null,"Egyéni főtábla",null,null,null,null,null,null,"",null,null,null,null,null,null,null,null,null,null,null,null,{"$f":"IF(Y5=1,CONCATENATE(VLOOKUP(Y3,AA16:AH27,2)),CONCATENATE(VLOOKUP(Y3,AA2:AK13,2)))","v":{"$error":"#N/A"}},{"$f":"IF(Y5=1,CONCATENATE(VLOOKUP(Y3,AA16:AK27,3)),CONCATENATE(VLOOKUP(Y3,AA2:AK13,3)))","v":{"$error":"#N/A"}},{"$f":"IF(Y5=1,CONCATENATE(VLOOKUP(Y3,AA16:AK27,4)),CONCATENATE(VLOOKUP(Y3,AA2:AK13,4)))","v":{"$error":"#N/A"}},{"$f":"IF(Y5=1,CONCATENATE(VLOOKUP(Y3,AA16:AK27,5)),CONCATENATE(VLOOKUP(Y3,AA2:AK13,5)))","v":{"$error":"#N/A"}},{"$f":"IF(Y5=1,CONCATENATE(VLOOKUP(Y3,AA16:AK27,6)),CONCATENATE(VLOOKUP(Y3,AA2:AK13,6)))","v":{"$error":"#N/A"}},{"$f":"IF(Y5=1,CONCATENATE(VLOOKUP(Y3,AA16:AK27,7)),CONCATENATE(VLOOKUP(Y3,AA2:AK13,7)))","v":{"$error":"#N/A"}},{"$f":"IF(Y5=1,CONCATENATE(VLOOKUP(Y3,AA16:AK27,8)),CONCATENATE(VLOOKUP(Y3,AA2:AK13,8)))","v":{"$error":"#N/A"}},{"$f":"IF(Y5=1,CONCATENATE(VLOOKUP(Y3,AA16:AK27,9)),CONCATENATE(VLOOKUP(Y3,AA2:AK13,9)))","v":{"$error":"#N/A"}},{"$f":"IF(Y5=1,CONCATENATE(VLOOKUP(Y3,AA16:AK27,10)),CONCATENATE(VLOOKUP(Y3,AA2:AK13,10)))","v":{"$error":"#N/A"}},{"$f":"IF(Y5=1,CONCATENATE(VLOOKUP(Y3,AA16:AK27,11)),CONCATENATE(VLOOKUP(Y3,AA2:AK13,11)))","v":{"$error":"#N/A"}}]
["Versenyszám:",null,null,null,{"$f":"Altalanos!$C$8","v":"Zöld lány"},null,null,null,null,null,null,null,null,null,null,null,null,null,null,null,null,null,null,null,null,null,"A",150,120,100,80,70,60,55,50,45,40]
["Dátum",null,null,null,"Város",null,null,"Kategória",null,null,null,"Versenybíró",null,null,null,null,null,null,null,null,null,null,null,null,{"$f":"IF(H4=\"OB\",\"A\",IF(H4=\"IX\",\"W\",H4))","v":0},null,"I",120,90,65,55,50,45,40,35,25,20]
[{"$f":"Altalanos!$A$10","v":"2018.05.28-31."},null,null,null,{"$f":"Altalanos!$C$10","v":"Balatonboglár"},null,null,null,null,null,null,{"$f":"Altalanos!$E$10","v":"Rákóczi Andrea"},null,null,null,"1 FORDULÓ","B - E","C - D",null,null,null,null,null,null,null,null,"II",90,60,45,34,27,22,18,15,12,9]
[null,"kiem","kódszám","Rangsor","Vezetéknév",null,"Keresztnév",null,"Egyesület",null,"Helyezés","Pontszám","Bónusz",null,null,"2 FORDULÓ","D - B","E - A",null,null,null,null,null,null,{"$f":"IF(OR(Altalanos!$A$8=\"F1\",Altalanos!$A$8=\"F2\",Altalanos!$A$8=\"N1\",Altalanos!$A$8=\"N2\"),1,2)","v":2},null,"III",60,40,30,20,18,15,12,10,8,6]
[null,null,null,null,null,null,null,null,null,null,null,null,null,null,null,"3 FORDULÓ","A - D","B - C",null,null,null,null,null,null,null,null,"IV",40,25,18,13,10,8,6,5,4,3]
["A",2,{"$f":"IF($B7=\"\",\"\",VLOOKUP($B7,'Zőld lány elo'!$A$7:$O$22,5))","v":0},{"$f":"IF($B7=\"\",\"\",VLOOKUP($B7,'Zőld lány elo'!$A$7:$O$22,15))","v":0},"Gothard J. Ált. Isk.",null,{"$f":"IF($B7=\"\",\"\",VLOOKUP($B7,'Zőld lány elo'!$A$7:$O$22,3))","v":0},null,{"$f":"IF($B7=\"\",\"\",VLOOKUP($B7,'Zőld lány elo'!$A$7:$O$22,4))","v":"Szombathely"},null,"III.",null,null,null,null,"4 FORDULÓ","C - A","D - E",null,null,null,null,null,null,null,null,"V",25,15,13,8,6,4,3,2,1,0]
[null,null,null,null,null,null,null,null,null,null,null,null,null,null,null,"5 FORDULÓ","A - B","E - C",null,null,null,null,null,null,null,null,"VI",15,10,7,5,4,3,2,1,0,0]
["B",4,{"$f":"IF($B9=\"\",\"\",VLOOKUP($B9,'Zőld lány elo'!$A$7:$O$22,5))","v":0},{"$f":"IF($B9=\"\",\"\",VLOOKUP($B9,'Zőld lány elo'!$A$7:$O$22,15))","v":0},"Implom J. Ált-Isk.",null,{"$f":"IF($B9=\"\",\"\",VLOOKUP($B9,'Zőld lány elo'!$A$7:$O$22,3))","v":0},null,{"$f":"IF($B9=\"\",\"\",VLOOKUP($B9,'Zőld lány elo'!$A$7:$O$22,4))","v":"Gyula"},null,"II.",null,null,null,null,null,null,null,null,null,null,null,null,null,null,null,"VII",10,6,4,2,1,0,0,0,0,0]
[null,null,null,null,null,null,null,null,null,null,null,null,null,null,null,null,null,null,null,null,null,null,null,null,null,null,"VIII",6,3,2,1,0,0,0,0,0,0]
["C",1,{"$f":"IF($B11=\"\",\"\",VLOOKUP($B11,'Zőld lány elo'!$A$7:$O$22,5))","v":0},{"$f":"IF($B11=\"\",\"\",VLOOKUP($B11,'Zőld lány elo'!$A$7:$O$22,15))","v":0},"Fazekas M.N.Ny.Ált.Isk.",null,{"$f":"IF($B11=\"\",\"\",VLOOKUP($B11,'Zőld lány elo'!$A$7:$O$22,3))","v":0},null,{"$f":"IF($B11=\"\",\"\",VLOOKUP($B11,'Zőld lány elo'!$A$7:$O$22,4))","v":"Dunakeszi"},null,"I",null,null,null,null,null,null,null,null,null,null,null,null,null,null,null,"W",3,2,1,0,0,0,0,0,0,0]
[null,null,null,null,null,null,null,null,null,null,null,null,null,null,null,null,null,null,null,null,null,null,null,null,null,null,"X",0,0,0,0,0,0,0,0,0,0]
["D",5,{"$f":"IF($B13=\"\",\"\",VLOOKUP($B13,'Zőld lány elo'!$A$7:$O$22,5))","v":0},{"$f":"IF($B13=\"\",\"\",VLOOKUP($B13,'Zőld lány elo'!$A$7:$O$22,15))","v":0},"Pollack M. Ált.Isk.",null,{"$f":"IF($B13=\"\",\"\",VLOOKUP($B13,'Zőld lány elo'!$A$7:$O$22,3))","v":0},null,{"$f":"IF($B13=\"\",\"\",VLOOKUP($B13,'Zőld lány elo'!$A$7:$O$22,4))","v":"Kazincbarcika"},null,null,null,null,null,null,null,null,null,null,null,null,null,null,null,null,null,"XI",0,0,0,0,0,0,0,0,0,0]
[]
["E",3,{"$f":"IF($B15=\"\",\"\",VLOOKUP($B15,'Zőld lány elo'!$A$7:$O$22,5))","v":0},{"$f":"IF($B15=\"\",\"\",VLOOKUP($B15,'Zőld lány elo'!$A$7:$O$22,15))","v":0},"Nádorvárosi Éz. Ált.Isk.",null,{"$f":"IF($B15=\"\",\"\",VLOOKUP($B15,'Zőld lány elo'!$A$7:$O$22,3))","v":0},null,{"$f":"IF($B15=\"\",\"\",VLOOKUP($B15,'Zőld lány elo'!$A$7:$O$22,4))","v":"Győr"},null,"IV."]
[null,null,null,null,null,null,null,null,null,null,null,null,null,null,null,null,null,null,null,null,null,null,null,null,null,null,"A",300,250,220,180,160,150,140,130,120,110]
[null,null,null,null,null,null,null,null,null,null,null,null,null,null,null,null,null,null,null,null,null,null,null,null,null,null,"I",250,200,160,140,120,110,100,90,80,70]
[null,null,null,{"$f":"E7","v":"Gothard J. Ált. Isk."},null,{"$f":"E9","v":"Implom J. Ált-Isk."},null,{"$f":"E11","v":"Fazekas M.N.Ny.Ált.Isk."},null,{"$f":"E13","v":"Pollack M. Ált.Isk."},null,{"$f":"E15","v":"Nádorvárosi Éz. Ált.Isk."},null,null,null,null,null,null,null,null,null,null,null,null,null,null,"II",200,150,130,110,95,80,70,60,55,50]
["A",{"$f":"E7","v":"Gothard J. Ált. Isk."},null,null,null,"1/2",null,"0/2",null,"jn.V.",null,"2/1",null,null,null,null,null,null,null,null,null,null,null,null,null,null,"III",150,120,100,80,70,60,55,50,45,40]
["B",{"$f":"E9","v":"Implom J. Ált-Isk."},null,"2/1",null,null,null,"0/2",null,"jn.V.",null,"2/0",null,null,null,null,null,null,null,null,null,null,null,null,null,null,"IV",120,90,65,55,50,45,40,35,25,20]
["C",{"$f":"E11","v":"Fazekas M.N.Ny.Ált.Isk."},null,"2/0",null,"2/0",null,null,null,"jn.V.",null,"jn Gy.",null,null,null,null,null,null,null,null,null,null,null,null,null,null,"V",90,60,45,34,27,22,18,15,12,9]
["D",{"$f":"E13","v":"Pollack M. Ált.Isk."},null,null,null,null,null,null,null,null,null,null,null,null,null,null,null,null,null,null,null,null,null,null,null,null,"VI",60,40,30,20,18,15,12,10,8,6]
["E",{"$f":"E15","v":"Nádorvárosi Éz. Ált.Isk."},null,"1/2",null,"0/2",null,"jn V",null,null,null,null,null,null,null,null,null,null,null,null,null,null,null,null,null,null,"VII",40,25,18,13,8,7,6,5,4,3]
[null,null,null,null,null,null,null,null,null,null,null,null,null,null,null,null,null,null,null,null,null,null,null,null,null,null,"VIII",25,15,13,7,6,5,4,3,2,1]
[null,null,null,null,null,null,null,null,null,null,null,null,null,null,null,null,null,null,null,null,null,null,null,null,null,null,"W",15,10,8,4,3,2,1,0,0,0]
[null,null,null,null,null,null,null,null,null,null,null,null,null,null,null,null,null,null,null,null,null,null,null,null,null,null,"X",10,6,4,2,1,0,0,0,0,0]
[null,null,null,null,null,null,null,null,null,null,null,null,null,null,null,null,null,null,null,null,null,null,null,null,null,null,"XI",3,2,1,0,0,0,0,0,0,0]
[]
[]
[]
[]
[]
["Rangsor",null,null,"#","Kiemeltek",null,"#","Szerencés Vesztes",null,"Helyettesíti","Sorsolás időpontja"]
["Dátuma",null,null,null,null,null,"1",null,null,null,"Utolsó elfogadott játékos"]
["Utolsó DA",null,null,null,null,null,"2"]
[null,null,null,null,null,null,"3",null,null,null,"Sorsoló játékosok"]
[null,null,null,null,null,null,"4"]
[null,null,null,null,null,null,"5"]
[null,null,null,null,null,null,"6",null,null,null,"Versenybíró aláírása"]
[null,null,null,null,null,null,"7"]
[null,null,null,null,null,null,"8",null,null,null,{"$f":"L4","v":"Rákóczi Andrea"}]