{"text_format":"1","workbook":"xlsx","n_sheets":9,"sheets":["Altalanos","Birók","piros lány elo","1MD 8","1MD 16","narancs lány elo","1E5 (4)","Zőld lány elo","1E5 (3)"],"not_rendered":{"charts":0,"images":9,"macros":1,"external_links":0,"defined_names":25,"comments":5,"pivot_tables":0},"unopened":[],"bounds":{"document_bytes":16777216,"sheet_cells":100000,"rows_first":2000,"rows_last":500,"rows_between":2000,"halvings":0,"cell_chars":16384,"cell_head_chars":4096},"cells_cut":0,"cells_raw":0,"read":"whole","date_system":"1900"}

{"sheet":"Altalanos","index":0,"n_rows":12,"n_cols":5,"rows_kept":12,"cut":false,"hidden":false,"merged":[]}
["Magyar verseny táblakészítő"]
["Ezt az oldalt soha ne töröld le !!!"]
[]
["Töltsd ki a zöld mezőket!"]
["A verseny neve:"]
["Diákolimpia Orsz. Döntő"]
["Versenyszám 1","Versenyszám 2","Versenyszám 3","Versenyszám 4","Versenyszám 5"]
["Piros lány",null,"Zöld lány","Nrancs lány"]
["A verseny dátuma (éééé.hh.nn)",null,"Város",null,"Versenybíró:"]
["2018.05.28-31.",null,"Balatonboglár","  ","Rákóczi Andrea"]
{"$rows_left_out":3}
{"sheet":"Birók","index":1,"n_rows":30,"n_cols":16,"rows_kept":30,"cut":false,"hidden":false,"merged":[[5,0,5,1]]}
[{"$f":"Altalanos!$A$6","v":"Diákolimpia Orsz. Döntő"}]
[]
[null,"Közreműködő bírók"]
["Dátum","Város"]
[{"$f":"Altalanos!$A$10","v":"2018.05.28-31."},{"$f":"Altalanos!$C$10","v":"Balatonboglár"}]
["Töltsd ki a táblázatot a játékvezetők nevével. Az első 8 neve fog megjelenni a táblákban lévő legördülő menükben"]
[]
[]
[]
[]
{"$rows_left_out":21}
{"sheet":"piros lány elo","index":2,"n_rows":156,"n_cols":17,"rows_kept":156,"cut":false,"hidden":false,"merged":[]}
[{"$f":"Altalanos!$A$6","v":"Diákolimpia Orsz. Döntő"},null,null,null,"Egyéni főtábla"]
[null,"Versenyszám:",{"$f":"Altalanos!$A$8","v":"Piros lány"},null,"ELŐKÉSZÍTŐ LISTA"]
["NE TÖRÖLD KI EZT AZ OLDALT!     ",null,null,null,null,null,null,null,null,null,null,null,null,"Versenybíró aláírása"]
["Dátum",null,"Város","Kategória",null,null,null,"Versenybíró"]
[{"$f":"Altalanos!$A$10","v":"2018.05.28-31."},null,{"$f":"Altalanos!$C$10","v":"Balatonboglár"},{"$f":"Altalanos!$D$10","v":"  "},null,null,null,{"$f":"Altalanos!$E$10","v":"Rákóczi Andrea"}]
["Sor","Családi név","Keresztnév","Egyesület","Kódszám","Nevezett Igen","Aláírás","Nevezési rangsor",null,"NatSort\nif not \nSeed","NatSort","Seed Sort","AccBasic","Elfogadási státusz","Sorsolási rangsor","AccSort","Kiemelés"]
[1,"Bencés Apátság Illyés Gyula Ált és Alapfokú Művészeti Iskolája",null,"Tihany"]
[2,"Boglári Általános Iskola és Alapfokú Művészeti Iskola",null,"Balatonboglár"]
[3,"Diósgyőri Nagy Lajos Király Általános Iskola A",null,"Miskolc"]
[4]
{"$rows_left_out":147}
{"sheet":"1MD 8","index":3,"n_rows":62,"n_cols":34,"rows_kept":62,"cut":false,"hidden":false,"merged":[[3,0,3,2]]}
[{"$f":"Altalanos!$A$6","v":"Diákolimpia Orsz. Döntő"},null,null,null,null,null,null,null,null,null,"Egyéni főtábla",null,null,null,"",null,null,null,null,null,null,null,null,null,null,null,null,{"$f":"IF($Y$5=1,CONCATENATE(VLOOKUP($Y$3,$AA$2:$AH$14,2)),CONCATENATE(VLOOKUP($Y$3,$AA$16:$AH$25,2)))","v":{"$error":"#N/A"}},{"$f":"IF($Y$5=1,CONCATENATE(VLOOKUP($Y$3,$AA$2:$AH$14,3)),CONCATENATE(VLOOKUP($Y$3,$AA$16:$AH$25,3)))","v":{"$error":"#N/A"}},{"$f":"IF($Y$5=1,CONCATENATE(VLOOKUP($Y$3,$AA$2:$AH$14,4)),CONCATENATE(VLOOKUP($Y$3,$AA$16:$AH$25,4)))","v":{"$error":"#N/A"}},{"$f":"IF($Y$5=1,CONCATENATE(VLOOKUP($Y$3,$AA$2:$AH$14,5)),CONCATENATE(VLOOKUP($Y$3,$AA$16:$AH$25,5)))","v":{"$error":"#N/A"}},{"$f":"IF($Y$5=1,CONCATENATE(VLOOKUP($Y$3,$AA$2:$AH$14,6)),CONCATENATE(VLOOKUP($Y$3,$AA$16:$AH$25,6)))","v":{"$error":"#N/A"}},{"$f":"IF($Y$5=1,CONCATENATE(VLOOKUP($Y$3,$AA$2:$AH$14,7)),CONCATENATE(VLOOKUP($Y$3,$AA$16:$AH$25,7)))","v":{"$error":"#N/A"}},{"$f":"IF($Y$5=1,CONCATENATE(VLOOKUP($Y$3,$AA$2:$AH$14,8)),CONCATENATE(VLOOKUP($Y$3,$AA$16:$AH$25,8)))","v":{"$error":"#N/A"}}]
["Versenyszám:",null,null,null,{"$f":"Altalanos!$A$8","v":"Piros lány"},null,null,null,null,null,null,null,null,null,null,null,null,null,null,null,null,null,null,null,null,null,"A",300,250,200,150,120,90,40]
["Dátum",null,null,null,null,null,"Város",null,null,null,"Kategória",null,null,null,null,null,null,"Versenybíró",null,null,null,null,null,null,{"$f":"IF(K4=\"OB\",\"A\",IF(K4=\"IX\",\"W\",IF(K4=\"\",\"\",K4)))","v":""},null,"B",280,230,180,140,80,0,0]
[{"$f":"Altalanos!$A$10","v":"2018.05.28-31."},null,null,null,null,null,{"$f":"Altalanos!$C$10","v":"Balatonboglár"},null,null,null,null,null,null,null,null,null,null,{"$f":"Altalanos!$E$10","v":"Rákóczi Andrea"},null,null,null,null,null,null,null,null,"I",250,200,150,120,90,60,25]
[null,"St.","Rangsor","kód","Kiem","Családi név","Keresztnév",null,"Egyesület",null,"2. forduló",null,"Döntő",null,"Győztes",null,null,null,null,null,null,null,null,null,{"$f":"IF(OR(Altalanos!$A$8=\"F1\",Altalanos!$A$8=\"F2\",Altalanos!$A$8=\"N1\",Altalanos!$A$8=\"N2\"),1,2)","v":2},null,"II",200,150,120,90,60,40,15]
[null,null,null,null,null,{"$f":"IF(Y3=\"\",\"\",CONCATENATE(VLOOKUP(Y3,AB1:AH1,4),\" pont\"))","v":""},null,null,null,null,{"$f":"IF(Y3=\"\",\"\",CONCATENATE(VLOOKUP(Y3,AB1:AH1,3),\" pont\"))","v":""},null,{"$f":"IF(Y3=\"\",\"\",CONCATENATE(VLOOKUP(Y3,AB1:AH1,2),\" pont\"))","v":""},null,{"$f":"IF(Y3=\"\",\"\",CONCATENATE(VLOOKUP(Y3,AB1:AH1,1),\" pont\"))","v":""},null,null,null,null,null,null,null,null,null,null,null,"III",150,120,90,60,40,25,10]
[1,{"$f":"IF($E7=\"\",\"\",VLOOKUP($E7,'piros lány elo'!$A$7:$O$22,14))","v":""},{"$f":"IF($E7=\"\",\"\",VLOOKUP($E7,'piros lány elo'!$A$7:$O$22,15))","v":""},{"$f":"IF($E7=\"\",\"\",VLOOKUP($E7,'piros lány elo'!$A$7:$O$22,5))","v":""},null,{"$f":"UPPER(IF($E7=\"\",\"\",VLOOKUP($E7,'piros lány elo'!$A$7:$O$22,2)))","v":""},{"$f":"IF($E7=\"\",\"\",VLOOKUP($E7,'piros lány elo'!$A$7:$O$22,3))","v":""},null,{"$f":"IF($E7=\"\",\"\",VLOOKUP($E7,'piros lány elo'!$A$7:$O$22,4))","v":""},null,null,null,null,null,null,null,null,null,null,null,{"$f":"Birók!P21","v":"Bíró"},null,null,null,null,null,"IV",120,90,60,40,25,10,5]
[null,null,null,null,null,null,null,null,"Umpire","b",{"$f":"UPPER(IF(OR(J8=\"a\",J8=\"as\"),F7,IF(OR(J8=\"b\",J8=\"bs\"),F9,)))","v":"BENCÉS APÁTSÁG ILLYÉS GYULA ÁLT ÉS ALAPFOKÚ MŰVÉSZETI ISKOLÁJA"},null,null,null,null,null,null,null,null,null,{"$f":"Birók!P22","v":" "},null,null,null,null,null,"V",90,60,40,25,10,5,2]
[2,{"$f":"IF($E9=\"\",\"\",VLOOKUP($E9,'piros lány elo'!$A$7:$O$22,14))","v":0},{"$f":"IF($E9=\"\",\"\",VLOOKUP($E9,'piros lány elo'!$A$7:$O$22,15))","v":0},{"$f":"IF($E9=\"\",\"\",VLOOKUP($E9,'piros lány elo'!$A$7:$O$22,5))","v":0},1,{"$f":"UPPER(IF($E9=\"\",\"\",VLOOKUP($E9,'piros lány elo'!$A$7:$O$22,2)))","v":"BENCÉS APÁTSÁG ILLYÉS GYULA ÁLT ÉS ALAPFOKÚ MŰVÉSZETI ISKOLÁJA"},{"$f":"IF($E9=\"\",\"\",VLOOKUP($E9,'piros lány elo'!$A$7:$O$22,3))","v":0},null,{"$f":"IF($E9=\"\",\"\",VLOOKUP($E9,'piros lány elo'!$A$7:$O$22,4))","v":"Tihany"},null,null,null,null,null,null,null,null,null,null,null,{"$f":"Birók!P23","v":" "},null,null,null,null,null,"VI",60,40,25,10,5,2,1]
[null,null,null,null,null,null,null,null,null,null,"Umpire","a",{"$f":"UPPER(IF(OR(L10=\"a\",L10=\"as\"),K8,IF(OR(L10=\"b\",L10=\"bs\"),K12,)))","v":"BENCÉS APÁTSÁG ILLYÉS GYULA ÁLT ÉS ALAPFOKÚ MŰVÉSZETI ISKOLÁJA"},null,null,null,null,null,null,null,{"$f":"Birók!P24","v":" "},null,null,null,null,null,"VII",40,25,15,7,4,1,0]
{"$rows_left_out":53}
{"sheet":"1MD 16","index":4,"n_rows":57,"n_cols":34,"rows_kept":57,"cut":false,"hidden":false,"merged":[[3,0,3,2]]}
[{"$f":"Altalanos!$A$6","v":"Diákolimpia Orsz. Döntő"},null,null,null,null,null,null,null,null,null,"Egyéni főtábla",null,null,null,"CU",null,null,null,null,null,null,null,null,null,null,null,null,{"$f":"IF($Y$5=1,CONCATENATE(VLOOKUP($Y$3,$AA$2:$AH$14,2)),CONCATENATE(VLOOKUP($Y$3,$AA$16:$AH$25,2)))","v":{"$error":"#N/A"}},{"$f":"IF($Y$5=1,CONCATENATE(VLOOKUP($Y$3,$AA$2:$AH$14,3)),CONCATENATE(VLOOKUP($Y$3,$AA$16:$AH$25,3)))","v":{"$error":"#N/A"}},{"$f":"IF($Y$5=1,CONCATENATE(VLOOKUP($Y$3,$AA$2:$AH$14,4)),CONCATENATE(VLOOKUP($Y$3,$AA$16:$AH$25,4)))","v":{"$error":"#N/A"}},{"$f":"IF($Y$5=1,CONCATENATE(VLOOKUP($Y$3,$AA$2:$AH$14,5)),CONCATENATE(VLOOKUP($Y$3,$AA$16:$AH$25,5)))","v":{"$error":"#N/A"}},{"$f":"IF($Y$5=1,CONCATENATE(VLOOKUP($Y$3,$AA$2:$AH$14,6)),CONCATENATE(VLOOKUP($Y$3,$AA$16:$AH$25,6)))","v":{"$error":"#N/A"}},{"$f":"IF($Y$5=1,CONCATENATE(VLOOKUP($Y$3,$AA$2:$AH$14,7)),CONCATENATE(VLOOKUP($Y$3,$AA$16:$AH$25,7)))","v":{"$error":"#N/A"}},{"$f":"IF($Y$5=1,CONCATENATE(VLOOKUP($Y$3,$AA$2:$AH$14,8)),CONCATENATE(VLOOKUP($Y$3,$AA$16:$AH$25,8)))","v":{"$error":"#N/A"}}]
["Versenyszám:",null,null,null,{"$f":"Altalanos!$A$8","v":"Piros lány"},null,null,null,null,null,null,null,null,null,null,null,null,null,null,null,null,null,null,null,null,null,"A",300,250,200,150,120,90,40]
["Dátum",null,null,null,null,null,"Város",null,null,null,"Kategória",null,null,null,null,null,null,"Versenybíró",null,null,null,null,null,null,{"$f":"IF(K4=\"OB\",\"A\",IF(K4=\"IX\",\"W\",IF(K4=\"\",\"\",K4)))","v":""},null,"B",280,230,180,140,80,0,0]
[{"$f":"Altalanos!$A$10","v":"2018.05.28-31."},null,null,null,null,null,{"$f":"Altalanos!$C$10","v":"Balatonboglár"},null,null,null,null,null,null,null,null,null,null,{"$f":"Altalanos!$E$10","v":"Rákóczi Andrea"},null,null,null,null,null,null,null,null,"I",250,200,150,120,90,60,25]
[null,"St.","Rangsor","kód","Kiem","Családi név","Keresztnév",null,"Egyesület",null,"2. forduló",null,"Elődöntők",null,"Döntő",null,"Győztes",null,null,null,null,null,null,null,{"$f":"IF(OR(Altalanos!$A$8=\"F1\",Altalanos!$A$8=\"F2\",Altalanos!$A$8=\"N1\",Altalanos!$A$8=\"N2\"),1,2)","v":2},null,"II",200,150,120,90,60,40,15]
[null,null,null,null,null,{"$f":"IF(Y3=\"\",\"\",CONCATENATE(AH1,\" / \",VLOOKUP(Y3,AB1:AH1,5),\" pont\"))","v":""},null,null,null,null,{"$f":"IF(Y3=\"\",\"\",CONCATENATE(VLOOKUP(Y3,AB1:AH1,4),\" pont\"))","v":""},null,{"$f":"IF(Y3=\"\",\"\",CONCATENATE(VLOOKUP(Y3,AB1:AH1,3),\" pont\"))","v":""},null,{"$f":"IF(Y3=\"\",\"\",CONCATENATE(VLOOKUP(Y3,AB1:AH1,2),\" pont\"))","v":""},null,{"$f":"IF(Y3=\"\",\"\",CONCATENATE(VLOOKUP(Y3,AB1:AH1,1),\" pont\"))","v":""},null,null,null,null,null,null,null,null,null,"III",150,120,90,60,40,25,10]
[1,{"$f":"IF($E7=\"\",\"\",VLOOKUP($E7,'piros lány elo'!$A$7:$O$22,14))","v":0},{"$f":"IF($E7=\"\",\"\",VLOOKUP($E7,'piros lány elo'!$A$7:$O$22,15))","v":0},{"$f":"IF($E7=\"\",\"\",VLOOKUP($E7,'piros lány elo'!$A$7:$O$22,5))","v":0},1,{"$f":"UPPER(IF($E7=\"\",\"\",VLOOKUP($E7,'piros lány elo'!$A$7:$O$22,2)))","v":"BENCÉS APÁTSÁG ILLYÉS GYULA ÁLT ÉS ALAPFOKÚ MŰVÉSZETI ISKOLÁJA"},{"$f":"IF($E7=\"\",\"\",VLOOKUP($E7,'piros lány elo'!$A$7:$O$22,3))","v":0},null,{"$f":"IF($E7=\"\",\"\",VLOOKUP($E7,'piros lány elo'!$A$7:$O$22,4))","v":"Tihany"},null,null,null,null,null,null,null,null,null,null,null,{"$f":"Birók!P21","v":"Bíró"},null,null,null,null,null,"IV",120,90,60,40,25,10,5]
[null,null,null,null,null,null,null,null,"Umpire","as",{"$f":"UPPER(IF(OR(J8=\"a\",J8=\"as\"),F7,IF(OR(J8=\"b\",J8=\"bs\"),F9,)))","v":"BENCÉS APÁTSÁG ILLYÉS GYULA ÁLT ÉS ALAPFOKÚ MŰVÉSZETI ISKOLÁJA"},null,null,null,null,null,null,null,null,null,{"$f":"Birók!P22","v":" "},null,null,null,null,null,"V",90,60,40,25,10,5,2]
[2,{"$f":"IF($E9=\"\",\"\",VLOOKUP($E9,'piros lány elo'!$A$7:$O$22,14))","v":""},{"$f":"IF($E9=\"\",\"\",VLOOKUP($E9,'piros lány elo'!$A$7:$O$22,15))","v":""},{"$f":"IF($E9=\"\",\"\",VLOOKUP($E9,'piros lány elo'!$A$7:$O$22,5))","v":""},null,"x",{"$f":"IF($E9=\"\",\"\",VLOOKUP($E9,'piros lány elo'!$A$7:$O$22,3))","v":""},null,{"$f":"IF($E9=\"\",\"\",VLOOKUP($E9,'piros lány elo'!$A$7:$O$22,4))","v":""},null,null,null,null,null,null,null,null,null,null,null,{"$f":"Birók!P23","v":" "},null,null,null,null,null,"VI",60,40,25,10,5,2,1]
[null,null,null,null,null,null,null,null,null,null,"Umpire","b",{"$f":"UPPER(IF(OR(L10=\"a\",L10=\"as\"),K8,IF(OR(L10=\"b\",L10=\"bs\"),K12,)))","v":"KISKUNFÉLEGYHÁZI JÓZSEF ATTILA ÁLTALÁNOS ISKOLA"},null,null,null,null,null,null,null,{"$f":"Birók!P24","v":" "},null,null,null,null,null,"VII",40,25,15,7,4,1,0]
{"$rows_left_out":48}
{"sheet":"narancs lány elo","index":5,"n_rows":156,"n_cols":17,"rows_kept":156,"cut":false,"hidden":false,"merged":[]}
[{"$f":"Altalanos!$A$6","v":"Diákolimpia Orsz. Döntő"},null,null,null,"Egyéni főtábla"]
[null,"Versenyszám:",{"$f":"Altalanos!$D$8","v":"Nrancs lány"},null,"ELŐKÉSZÍTŐ LISTA"]
["NE TÖRÖLD KI EZT AZ OLDALT!     ",null,null,null,null,null,null,null,null,null,null,null,null,"Versenybíró aláírása"]
["Dátum",null,"Város","Kategória",null,null,null,"Versenybíró"]
[{"$f":"Altalanos!$A$10","v":"2018.05.28-31."},null,{"$f":"Altalanos!$C$10","v":"Balatonboglár"},{"$f":"Altalanos!$D$10","v":"  "},null,null,null,{"$f":"Altalanos!$E$10","v":"Rákóczi Andrea"}]
["Sor","Családi név","Keresztnév","Egyesület","Kódszám","Nevezett Igen","Aláírás","Nevezési rangsor",null,"NatSort\nif not \nSeed","NatSort","Seed Sort","AccBasic","Elfogadási státusz","Sorsolási rangsor","AccSort","Kiemelés"]
[1,"Gothard Jenő Általános Iskola",null,"Szombathely"]
[2,"Kodály Zoltán Ének-zenei Ált. Isk.",null,"Győri"]
[3,"Pécsi Bártfa Utcai Általános Iskola",null,"Pécs"]
[4,"Siófoki Széchenyi István Általános Iskola",null,"Siófok"]
{"$rows_left_out":147}
{"sheet":"1E5 (4)","index":6,"n_rows":41,"n_cols":37,"rows_kept":41,"cut":false,"hidden":false,"merged":[[0,0,0,5],[3,0,3,2],[6,4,6,5],[6,6,6,7],[8,4,8,5],[8,6,8,7],[10,4,10,5],[10,6,10,7],[12,4,12,5],[12,6,12,7],[14,4,14,5],[14,6,14,7],[17,1,17,2],[17,3,17,4],[17,5,17,6],[17,7,17,8],[17,9,17,10],[17,11,17,12],[18,1,18,2],[18,3,18,4],[18,5,18,6],[18,7,18,8],[18,9,18,10],[18,11,18,12],[19,1,19,2],[19,3,19,4],[19,5,19,6],[19,7,19,8],[19,9,19,10],[19,11,19,12],[20,1,20,2],[20,3,20,4],[20,5,20,6],[20,7,20,8],[20,9,20,10],[20,11,20,12],[22,9,22,10],[22,11,22,12],[21,1,21,2],[21,3,21,4],[21,5,21,6],[21,7,21,8],[21,9,21,10],[21,11,21,12],[33,4,33,5],[34,4,34,5],[22,1,22,2],[22,3,22,4],[22,5,22,6],[22,7,22,8]]}
[{"$f":"Altalanos!$A$6","v":"Diákolimpia Orsz. Döntő"},null,null,null,null,null,null,"Egyéni főtábla",null,null,null,null,null,null,"",null,null,null,null,null,null,null,null,null,null,null,null,{"$f":"IF(Y5=1,CONCATENATE(VLOOKUP(Y3,AA16:AH27,2)),CONCATENATE(VLOOKUP(Y3,AA2:AK13,2)))","v":{"$error":"#N/A"}},{"$f":"IF(Y5=1,CONCATENATE(VLOOKUP(Y3,AA16:AK27,3)),CONCATENATE(VLOOKUP(Y3,AA2:AK13,3)))","v":{"$error":"#N/A"}},{"$f":"IF(Y5=1,CONCATENATE(VLOOKUP(Y3,AA16:AK27,4)),CONCATENATE(VLOOKUP(Y3,AA2:AK13,4)))","v":{"$error":"#N/A"}},{"$f":"IF(Y5=1,CONCATENATE(VLOOKUP(Y3,AA16:AK27,5)),CONCATENATE(VLOOKUP(Y3,AA2:AK13,5)))","v":{"$error":"#N/A"}},{"$f":"IF(Y5=1,CONCATENATE(VLOOKUP(Y3,AA16:AK27,6)),CONCATENATE(VLOOKUP(Y3,AA2:AK13,6)))","v":{"$error":"#N/A"}},{"$f":"IF(Y5=1,CONCATENATE(VLOOKUP(Y3,AA16:AK27,7)),CONCATENATE(VLOOKUP(Y3,AA2:AK13,7)))","v":{"$error":"#N/A"}},{"$f":"IF(Y5=1,CONCATENATE(VLOOKUP(Y3,AA16:AK27,8)),CONCATENATE(VLOOKUP(Y3,AA2:AK13,8)))","v":{"$error":"#N/A"}},{"$f":"IF(Y5=1,CONCATENATE(VLOOKUP(Y3,AA16:AK27,9)),CONCATENATE(VLOOKUP(Y3,AA2:AK13,9)))","v":{"$error":"#N/A"}},{"$f":"IF(Y5=1,CONCATENATE(VLOOKUP(Y3,AA16:AK27,10)),CONCATENATE(VLOOKUP(Y3,AA2:AK13,10)))","v":{"$error":"#N/A"}},{"$f":"IF(Y5=1,CONCATENATE(VLOOKUP(Y3,AA16:AK27,11)),CONCATENATE(VLOOKUP(Y3,AA2:AK13,11)))","v":{"$error":"#N/A"}}]
["Versenyszám:",null,null,null,{"$f":"Altalanos!$D$8","v":"Nrancs lány"},null,null,null,null,null,null,null,null,null,null,null,null,null,null,null,null,null,null,null,null,null,"A",150,120,100,80,70,60,55,50,45,40]
["Dátum",null,null,null,"Város",null,null,"Kategória",null,null,null,"Versenybíró",null,null,null,null,null,null,null,null,null,null,null,null,{"$f":"IF(H4=\"OB\",\"A\",IF(H4=\"IX\",\"W\",H4))","v":0},null,"I",120,90,65,55,50,45,40,35,25,20]
[{"$f":"Altalanos!$A$10","v":"2018.05.28-31."},null,null,null,{"$f":"Altalanos!$C$10","v":"Balatonboglár"},null,null,null,null,null,null,{"$f":"Altalanos!$E$10","v":"Rákóczi Andrea"},null,null,null,"1 FORDULÓ","B - E","C - D",null,null,null,null,null,null,null,null,"II",90,60,45,34,27,22,18,15,12,9]
[null,"kiem","kódszám","Rangsor","Vezetéknév",null,"Keresztnév",null,"Egyesület",null,"Helyezés","Pontszám","Bónusz",null,null,"2 FORDULÓ","D - B","E - A",null,null,null,null,null,null,{"$f":"IF(OR(Altalanos!$A$8=\"F1\",Altalanos!$A$8=\"F2\",Altalanos!$A$8=\"N1\",Altalanos!$A$8=\"N2\"),1,2)","v":2},null,"III",60,40,30,20,18,15,12,10,8,6]
[null,null,null,null,null,null,null,null,null,null,null,null,null,null,null,"3 FORDULÓ","A - D","B - C",null,null,null,null,null,null,null,null,"IV",40,25,18,13,10,8,6,5,4,3]
["A",2,{"$f":"IF($B7=\"\",\"\",VLOOKUP($B7,'narancs lány elo'!$A$7:$O$22,5))","v":0},{"$f":"IF($B7=\"\",\"\",VLOOKUP($B7,'narancs lány elo'!$A$7:$O$22,15))","v":0},"Kodály Zoltán Éz. Ált.Isk.",null,{"$f":"IF($B7=\"\",\"\",VLOOKUP($B7,'narancs lány elo'!$A$7:$O$22,3))","v":0},null,"Szombathely",null,"IV.",null,null,null,null,"4 FORDULÓ","C - A","D - E",null,null,null,null,null,null,null,null,"V",25,15,13,8,6,4,3,2,1,0]
[null,null,null,null,null,null,null,null,null,null,null,null,null,null,null,"5 FORDULÓ","A - B","E - C",null,null,null,null,null,null,null,null,"VI",15,10,7,5,4,3,2,1,0,0]
["B",4,{"$f":"IF($B9=\"\",\"\",VLOOKUP($B9,'narancs lány elo'!$A$7:$O$22,5))","v":0},{"$f":"IF($B9=\"\",\"\",VLOOKUP($B9,'narancs lány elo'!$A$7:$O$22,15))","v":0},"Széchelyi István Ált.Isk.",null,{"$f":"IF($B9=\"\",\"\",VLOOKUP($B9,'narancs lány elo'!$A$7:$O$22,3))","v":0},null,{"$f":"IF($B9=\"\",\"\",VLOOKUP($B9,'narancs lány elo'!$A$7:$O$22,4))","v":"Siófok"},null,"III.",null,null,null,null,null,null,null,null,null,null,null,null,null,null,null,"VII",10,6,4,2,1,0,0,0,0,0]
[null,null,null,null,null,null,null,null,null,null,null,null,null,null,null,null,null,null,null,null,null,null,null,null,null,null,"VIII",6,3,2,1,0,0,0,0,0,0]
{"$rows_left_out":32}
{"sheet":"Zőld lány elo","index":7,"n_rows":156,"n_cols":17,"rows_kept":156,"cut":false,"hidden":false,"merged":[]}
[{"$f":"Altalanos!$A$6","v":"Diákolimpia Orsz. Döntő"},null,null,null,"Egyéni főtábla"]
[null,"Versenyszám:",{"$f":"Altalanos!$C$8","v":"Zöld lány"},null,"ELŐKÉSZÍTŐ LISTA"]
["NE TÖRÖLD KI EZT AZ OLDALT!     ",null,null,null,null,null,null,null,null,null,null,null,null,"Versenybíró aláírása"]
["Dátum",null,"Város","Kategória",null,null,null,"Versenybíró"]
[{"$f":"Altalanos!$A$10","v":"2018.05.28-31."},null,{"$f":"Altalanos!$C$10","v":"Balatonboglár"},{"$f":"Altalanos!$D$10","v":"  "},null,null,null,{"$f":"Altalanos!$E$10","v":"Rákóczi Andrea"}]
["Sor","Családi név","Keresztnév","Egyesület","Kódszám","Nevezett Igen","Aláírás","Nevezési rangsor",null,"NatSort\nif not \nSeed","NatSort","Seed Sort","AccBasic","Elfogadási státusz","Sorsolási rangsor","AccSort","Kiemelés"]
[1,"Fazekas Mihály Német Nyelvoktató Nemzetiségi Ált. Isk.",null,"Dunakeszi"]
[2,"Gothard Jenő Általános Iskola",null,"Szombathely"]
[3,"Győri Nádorvárosi Ének-zenei Általános Iskola",null,"Győr"]
[4,"Gyulai Implom József Általános Iskola",null,"Gyula"]
{"$rows_left_out":147}
{"sheet":"1E5 (3)","index":8,"n_rows":41,"n_cols":37,"rows_kept":41,"cut":false,"hidden":false,"merged":[[0,0,0,5],[3,0,3,2],[6,4,6,5],[6,6,6,7],[8,4,8,5],[8,6,8,7],[10,4,10,5],[10,6,10,7],[12,4,12,5],[12,6,12,7],[14,4,14,5],[14,6,14,7],[17,1,17,2],[17,3,17,4],[17,5,17,6],[17,7,17,8],[17,9,17,10],[17,11,17,12],[18,1,18,2],[18,3,18,4],[18,5,18,6],[18,7,18,8],[18,9,18,10],[18,11,18,12],[19,1,19,2],[19,3,19,4],[19,5,19,6],[19,7,19,8],[19,9,19,10],[19,11,19,12],[20,1,20,2],[20,3,20,4],[20,5,20,6],[20,7,20,8],[20,9,20,10],[20,11,20,12],[22,9,22,10],[22,11,22,12],[21,1,21,2],[21,3,21,4],[21,5,21,6],[21,7,21,8],[21,9,21,10],[21,11,21,12],[33,4,33,5],[34,4,34,5],[22,1,22,2],[22,3,22,4],[22,5,22,6],[22,7,22,8]]}
[{"$f":"Altalanos!$A$6","v":"Diákolimpia Orsz. Döntő"},null,null,null,null,null,null,"Egyéni főtábla",null,null,null,null,null,null,"",null,null,null,null,null,null,null,null,null,null,null,null,{"$f":"IF(Y5=1,CONCATENATE(VLOOKUP(Y3,AA16:AH27,2)),CONCATENATE(VLOOKUP(Y3,AA2:AK13,2)))","v":{"$error":"#N/A"}},{"$f":"IF(Y5=1,CONCATENATE(VLOOKUP(Y3,AA16:AK27,3)),CONCATENATE(VLOOKUP(Y3,AA2:AK13,3)))","v":{"$error":"#N/A"}},{"$f":"IF(Y5=1,CONCATENATE(VLOOKUP(Y3,AA16:AK27,4)),CONCATENATE(VLOOKUP(Y3,AA2:AK13,4)))","v":{"$error":"#N/A"}},{"$f":"IF(Y5=1,CONCATENATE(VLOOKUP(Y3,AA16:AK27,5)),CONCATENATE(VLOOKUP(Y3,AA2:AK13,5)))","v":{"$error":"#N/A"}},{"$f":"IF(Y5=1,CONCATENATE(VLOOKUP(Y3,AA16:AK27,6)),CONCATENATE(VLOOKUP(Y3,AA2:AK13,6)))","v":{"$error":"#N/A"}},{"$f":"IF(Y5=1,CONCATENATE(VLOOKUP(Y3,AA16:AK27,7)),CONCATENATE(VLOOKUP(Y3,AA2:AK13,7)))","v":{"$error":"#N/A"}},{"$f":"IF(Y5=1,CONCATENATE(VLOOKUP(Y3,AA16:AK27,8)),CONCATENATE(VLOOKUP(Y3,AA2:AK13,8)))","v":{"$error":"#N/A"}},{"$f":"IF(Y5=1,CONCATENATE(VLOOKUP(Y3,AA16:AK27,9)),CONCATENATE(VLOOKUP(Y3,AA2:AK13,9)))","v":{"$error":"#N/A"}},{"$f":"IF(Y5=1,CONCATENATE(VLOOKUP(Y3,AA16:AK27,10)),CONCATENATE(VLOOKUP(Y3,AA2:AK13,10)))","v":{"$error":"#N/A"}},{"$f":"IF(Y5=1,CONCATENATE(VLOOKUP(Y3,AA16:AK27,11)),CONCATENATE(VLOOKUP(Y3,AA2:AK13,11)))","v":{"$error":"#N/A"}}]
["Versenyszám:",null,null,null,{"$f":"Altalanos!$C$8","v":"Zöld lány"},null,null,null,null,null,null,null,null,null,null,null,null,null,null,null,null,null,null,null,null,null,"A",150,120,100,80,70,60,55,50,45,40]
["Dátum",null,null,null,"Város",null,null,"Kategória",null,null,null,"Versenybíró",null,null,null,null,null,null,null,null,null,null,null,null,{"$f":"IF(H4=\"OB\",\"A\",IF(H4=\"IX\",\"W\",H4))","v":0},null,"I",120,90,65,55,50,45,40,35,25,20]
[{"$f":"Altalanos!$A$10","v":"2018.05.28-31."},null,null,null,{"$f":"Altalanos!$C$10","v":"Balatonboglár"},null,null,null,null,null,null,{"$f":"Altalanos!$E$10","v":"Rákóczi Andrea"},null,null,null,"1 FORDULÓ","B - E","C - D",null,null,null,null,null,null,null,null,"II",90,60,45,34,27,22,18,15,12,9]
[null,"kiem","kódszám","Rangsor","Vezetéknév",null,"Keresztnév",null,"Egyesület",null,"Helyezés","Pontszám","Bónusz",null,null,"2 FORDULÓ","D - B","E - A",null,null,null,null,null,null,{"$f":"IF(OR(Altalanos!$A$8=\"F1\",Altalanos!$A$8=\"F2\",Altalanos!$A$8=\"N1\",Altalanos!$A$8=\"N2\"),1,2)","v":2},null,"III",60,40,30,20,18,15,12,10,8,6]
[null,null,null,null,null,null,null,null,null,null,null,null,null,null,null,"3 FORDULÓ","A - D","B - C",null,null,null,null,null,null,null,null,"IV",40,25,18,13,10,8,6,5,4,3]
["A",2,{"$f":"IF($B7=\"\",\"\",VLOOKUP($B7,'Zőld lány elo'!$A$7:$O$22,5))","v":0},{"$f":"IF($B7=\"\",\"\",VLOOKUP($B7,'Zőld lány elo'!$A$7:$O$22,15))","v":0},"Gothard J. Ált. Isk.",null,{"$f":"IF($B7=\"\",\"\",VLOOKUP($B7,'Zőld lány elo'!$A$7:$O$22,3))","v":0},null,{"$f":"IF($B7=\"\",\"\",VLOOKUP($B7,'Zőld lány elo'!$A$7:$O$22,4))","v":"Szombathely"},null,"III.",null,null,null,null,"4 FORDULÓ","C - A","D - E",null,null,null,null,null,null,null,null,"V",25,15,13,8,6,4,3,2,1,0]
[null,null,null,null,null,null,null,null,null,null,null,null,null,null,null,"5 FORDULÓ","A - B","E - C",null,null,null,null,null,null,null,null,"VI",15,10,7,5,4,3,2,1,0,0]
["B",4,{"$f":"IF($B9=\"\",\"\",VLOOKUP($B9,'Zőld lány elo'!$A$7:$O$22,5))","v":0},{"$f":"IF($B9=\"\",\"\",VLOOKUP($B9,'Zőld lány elo'!$A$7:$O$22,15))","v":0},"Implom J. Ált-Isk.",null,{"$f":"IF($B9=\"\",\"\",VLOOKUP($B9,'Zőld lány elo'!$A$7:$O$22,3))","v":0},null,{"$f":"IF($B9=\"\",\"\",VLOOKUP($B9,'Zőld lány elo'!$A$7:$O$22,4))","v":"Gyula"},null,"II.",null,null,null,null,null,null,null,null,null,null,null,null,null,null,null,"VII",10,6,4,2,1,0,0,0,0,0]
[null,null,null,null,null,null,null,null,null,null,null,null,null,null,null,null,null,null,null,null,null,null,null,null,null,null,"VIII",6,3,2,1,0,0,0,0,0,0]
{"$rows_left_out":31}